Debian Package rebuild

Rebuild of the Debian archive with clang

"Argument unused caused failure" build failure(s)
clang 3.8.1
Return to the list
Unknown or unused arguments triggers errors with -Werror:
clang -Werror -ggdb3 foo.c

Versions: 2.9 - 3.0 - 3.1 - 3.2 - 3.3 - 3.4 - 3.4.2 - 3.5.0 - 3.6.0 - 3.8.1
PackageVersionSupposed error messageFull log Bug report
libsoldout 1.4-1clang: error: argument unused during compilation: '-pie' Log
libwebsockets 1.7.3-1clang: error: argument unused during compilation: '-pie' Log
spice-vdagent 0.15.0-1.3clang: error: argument unused during compilation: '-Wp,-D_FORTIFY_SOURCE=2' Log
3 errors
Return to the list