Debian Package rebuild

Rebuild of the Debian archive with clang

"Not categorized" build failure(s)
clang 8svn
Return to the list

Versions: 2.9 - 3.0 - 3.1 - 3.2 - 3.3 - 3.4 - 3.4.2 - 3.5.0 - 3.6.0 - 3.8.1 - 3.9.1 - 4.0.1 - 5.0 - 6.0 - 7.0.1 - 8svn
PackageVersionSupposed error messageFull log Bug report
0ad 0.0.23.1-1../../build/unix/gold/ld: error: hidden symbol 'ceil' is not defined locally Log
3dchess 0.8.1-20Undetected errorLog
9base 1:6-7n1.c:124:5: error: unterminated function-like macro invocation Log
ableton-link 3.0.2+dfsg-1AudioPlatform_Jack.cpp:33:18: error: zero as null pointer constant [-Werror,-Wzero-as-null-pointer-constant] Log
acpid 1:2.0.31-1configure: error: "asprintf() not found" Log
alljoyn-core-1509 15.09a+dfsg.1-3alljoyn_c/src/PermissionConfigurationListener.cc:33:17: error: using directive refers to implicitly-defined namespace 'std' [-Werror] Log
alljoyn-core-1604 16.04a+dfsg.1-3alljoyn_c/src/PermissionConfigurationListener.cc:32:17: error: using directive refers to implicitly-defined namespace 'std' [-Werror] Log
apbs 1.4-1Undetected errorLog
aplus-fsf 4.22.1-10configure: error: in `/<>' Log
apron 0.9.10-9ppl.hh:66465:8: error: missing 'typename' prior to dependent type template name 'OR_Matrix::Pseudo_Row' Log
aptitude 0.8.11-6../../../../src/generic/problemresolver/problemresolver.h:1725:17: error: use of non-static data member 'graph' of 'generic_problem_resolver' from nested type 'do_process_promotion' Log
arj 3.10.22-17Undetected errorLog
asterisk-espeak 5.0~1-1utils.h:1068:15: error: blocks support disabled - compile with -fblocks or pick a deployment target that supports them Log
asterisk-flite 3.0-2utils.h:1068:15: error: blocks support disabled - compile with -fblocks or pick a deployment target that supports them Log
asterisk-opus 13.7+20171009-1utils.h:1068:15: error: blocks support disabled - compile with -fblocks or pick a deployment target that supports them Log
auto-07p 0.9.1+dfsg-7configure: error: COIN3D is not installed Log
autodocksuite 4.2.6-6configure: error: in `/<>/autodock' Log
avifile 1:0.7.48~20090503.ds-20.1common/avm_output.cpp:20:12: error: qualified reference to 'AvmOutput' is a constructor name rather than a type in this context Log
bart 0.4.04-2multind.h:19:14: error: blocks support disabled - compile with -fblocks or pick a deployment target that supports them Log
bart-view 0.1.00-2multind.h:19:14: error: blocks support disabled - compile with -fblocks or pick a deployment target that supports them Log
bind-dyndb-ldap 11.1-5../../src/mldap.c:122:3: error: used type 'typeof (((isc_refcount_t *)0)->refs)' (aka '_Atomic(int_fast32_t)') where arithmetic or pointer type is required Log
bing 1.3.5-2bing_misc.c:208:46: error: too many arguments provided to function-like macro invocation Log
bmusb 0.7.3-2bmusb.cpp:641:16: error: 'target' attribute takes one argument Log
boinc 7.12.0+dfsg-1configure: error: in `/<>/boinc-7.12.0+dfsg' Log
boost1.67 1.67.0-11dh_install: missing files, aborting Log
busybox 1:1.27.2-3Undetected errorLog
castxml 0.1+git20180702-3Undetected errorLog
cataclysm-dda 0.C+git20181202.05d851e-3src/clzones.h:142:23: error: explicitly defaulted move assignment operator is implicitly deleted [-Werror,-Wdefaulted-function-deleted] Log
cbmc 5.10-5bv_arithmetic.cpp:90:10: error: local variable 'result' will be copied despite being returned by name [-Werror,-Wreturn-std-move] Log
cernlib 20061220+dfsg3-4.3Undetected errorLog
cgal 4.13-1Undetected errorLog
chealpix 3.30.0-6configure: error: in `/<>' Log
cigi-ccl 3.3.3a+svn818-10dh_install: missing files, aborting Log
clazy 1.4-4Undetected errorLog
clblas 2.12-1dh_install: missing files, aborting Log
clfft 2.12.2-1dh_install: missing files, aborting Log
collectd 5.8.1-1.2configure: error: strtok_r is not available. Please file a bugreport! Log 758481
comedilib 0.11.0-1clang: error: clang frontend command failed with exit code 70 (use -v to see invocation) Log
comptty 1.0.1-3comp_tty.cxx:27:30: error: character too large for enclosing character literal type Log
cpluff 0.1.4+dfsg1-1cpluff.c:84:35: error: too many arguments provided to function-like macro invocation Log
crawl 2:0.22.1-1Undetected errorLog
cura-engine 1:3.3.0-2.1logoutput.cpp:30:9: error: 'va_start' cannot be used in a captured statement Log
daligner 1.0+git20180524.fd21879-1Undetected errorLog
dascrubber 1.1-1Undetected errorLog
dazzdb 1.0+git20180908.0bd5e07-1Undetected errorLog
db5.3 5.3.28+dfsg1-0.2Undetected errorLog
dbuskit 0.1.1-3configure: error: "could not find runtime.h. DBusKit requires gnustep-base >=1.20." Log
dicom3tools 1.00~20180803063840-1./Imakefile:177:3: error: invalid preprocessing directive Log
directfb 1.7.7-8./String.h:126:51: error: format argument not a string type Log
djview4 4.11-1configure: error: Cannot successfully run Qt program qmake. Log
dogecoin 1.10.0-6./src/scalar_4x64_impl.h:362:19: error: value '4624529908474429119' out of range for constraint 'n' Log
dspdfviewer 1.15.1-1hyperlinkarea.cpp:35:18: error: zero as null pointer constant [-Werror,-Wzero-as-null-pointer-constant] Log
dune-pdelab 2.6~20180302-1optional:567:9: error: call to implicitly-deleted copy constructor of 'std::_Optional_payload >, YaspGeometry>, true, false, false>' Log
duo-unix 1.9.21-1.1dpkg-shlibdeps: error: cannot continue due to the error above Log
dxvk 0.94+ds1-1Undetected errorLog
efibootmgr 15-1make[3]: *** No rule to make target 'efivar.h', needed by 'efibootmgr.o'. Stop. Log 753644
ekg2 1:0.4~pre+20120506.1-16Makefile.am:144: error: 'plugins/autoresponder/autoresponder.la' is not a standard libtool library name Log
elfutils 0.175-2configure: error: gcc with GNU99 support required Log 758064
elpa 2016.05.001-6clang: error: gcc preprocessor command failed with exit code 255 (use -v to see invocation)clang: error: Log
esperanza 0.4.0+git20091017-5coll.h:615:6: error: binding value of type 'const Xmms::Coll::Coll' to reference to type 'Xmms::Coll::Coll' drops 'const' qualifier Log
etl 1.2.1-1fixed.cpp:133:55: error: no matching literal operator for call to 'operator""__FILE__' with arguments of types 'const char *' and 'unsigned long', and no matching literal operator template Log
f2j 0.8.1+dfsg-3clang: error: unable to execute command: Bus error Log
faumachine 20180503-4./../arch_x86/arch_gen_cpu_x86_state.h:190:31: error: register 'rbx' unsuitable for global register variables on this target Log
fbpanel 7.0-4Undetected errorLog
fcoe-utils 1.0.31+git20160622.5dfd3e4-5fcoemon.c:522:29: error: the value of the size argument in 'strncat' is too large, might lead to a buffer overflow [-Werror,-Wstrncat-size] Log
firebird3.0 3.0.5.33083.ds4-1libtool.m4: error: problem compiling CXX test program Log
fractalnow 0.8.2-1Undetected errorLog
gatb-core 1.4.1+dfsg-3Terminator.cpp:49:86: error: 'iteratorBranching' following the 'template' keyword does not refer to a template Log
gbsplay 0.0.93-3Undetected errorLog
gcc-7-cross 28configure: error: in `/<>/gcc/build/i686-linux-gnu/libhsail-rt' Log
gcc-7-cross-ports 22configure: error: in `/<>/gcc/build/x86_64-linux-gnux32/libhsail-rt' Log
gcc-8-cross 24configure: error: in `/<>/gcc/build/i686-linux-gnu/libhsail-rt' Log
gcc-8-cross-ports 16configure: error: in `/<>/gcc/build/x86_64-linux-gnux32/libhsail-rt' Log
geant321 1:3.21.14.dfsg-11Undetected errorLog
generator-scripting-language 4.1.5-3Undetected errorLog
gforth 0.7.3+dfsg-9Undetected errorLog
gnustep-base 1.25.1-4configure: error: Could not find Objective-C headers Log
google-perftools 2.7-1Undetected errorLog
gpg-remailer 3.04.04-1mail/../cleartextmail/../mailer/send.f:11:17: error: cannot cast 'Mailer' to its private base class 'MailerBase' Log
graphviz 2.40.1-5dh_install: missing files, aborting Log
grml2usb 0.16.2mbr.S:38:16: error: cannot use more than one symbol in memory operand Log
grub 0.97-75configure: error: GRUB requires GAS .code16 addr32 support; upgrade your binutils Log
grub2 2.02+dfsg1-9configure: error: could not force soft-float Log
haskell-alsa-mixer 0.2.0.3-3Undetected errorLog
haskell-lens 4.16.1-3Undetected errorLog
haskell-ncurses 0.2.16-3Undetected errorLog
haskell-thyme 0.3.5.5-4Undetected errorLog
healpix-cxx 3.50.0-2configure: error: in `/<>' Log
helpviewer.app 0.3-8clang: error: invalid value 'ISO-8859-1' in '-finput-charset=ISO-8859-1' Log
htslib 1.9-8configure: error: in `/<>' Log
hugs98 98.200609.21-5.4tools/make_bootlib: 68: tools/make_bootlib: -D__HUGS__: not found Log
hylafax 3:6.0.6-8.1Undetected errorLog
idjc 0.8.17-1configure: error: math library is missing critical function Log
imvirt 0.9.6-4vmware.c:65:5: error: invalid operand for instruction Log
jackd2 1.9.12~dfsg-2/bin/sh: 1: /usr/bin/licensecheck: not found Log 757820
jitterentropy-rngd 1.0.8-3jitterentropy-base.c:60:4: error: "The CPU Jitter random number generator must not be compiled with optimizations. See documentation. Use the compiler switch -O0 for compiling jitterentropy-base.c." Log
krita 1:4.1.7+dfsg-1intrinsics.h:601:13: error: argument to '__builtin_ia32_vec_ext_v4sf' must be a constant integer Log
lam 7.1.4-3.1configure: error: *** Cannot continue. Log
lastpass-cli 1.3.1-6Undetected errorLog
lcgdm 1.10.0-2Undetected errorLog
libdata-uuid-perl 1.220-1Undetected errorLog
libdbi-drivers 0.9.0-6Undetected errorLog
libgwenhywfar 4.20.0-7configure: error: Failed to find matching components of a complete Log
libkkc 0.3.5-4Undetected errorLog
libmdsp 0.11-10src/antoi.c:21:17: error: unknown kind of pragma comment Log
libomxalsa 0.1-2configure: error: POSIX threads support is required Log
libomxcamera 0.1-2configure: error: in `/<>' Log
libomxfbdevsink 0.1-2configure: error: in `/<>' Log
libomxmad 0.1-1configure: error: POSIX threads support is required Log
libomxvideosrc 0.1-1configure: error: in `/<>' Log
libomxvorbis 0.1-3configure: error: in `/<>' Log
libomxxvideo 0.1-3configure: error: POSIX threads support is required Log
libsecp256k1 0.1~20170810-2./src/scalar_4x64_impl.h:379:19: error: value '4624529908474429119' out of range for constraint 'n' Log
libtemplates-parser 19-3Undetected errorLog
libwx-perl 1:0.9932-5Undetected errorLog
libwx-scintilla-perl 0.39-4Undetected errorLog
libyami-utils 1.3.0-2VideoDecoderHost.h:38:26: error: 'getVideoDecoderMimeTypes' has C-linkage specified, but returns incomplete type 'std::vector' (aka 'vector >') which could be incompatible with C [-Werror,-Wreturn-type-c-linkage] Log
libzypp 17.7.0-1Exception.h:329:58: error: template parameter redefines default argument Log
lierolibre 0.5-3./src/gvl/io/encoding.hpp:586:19: error: cast from pointer to smaller type 'uint32_t' (aka 'unsigned int') loses information Log
linbox 1.5.2-2Undetected errorLog
linux 4.19.13-1Undetected errorLog
litecoin 0.16.3-2./src/scalar_4x64_impl.h:379:19: error: value '4624529908474429119' out of range for constraint 'n' Log
lookup 1.08b-12lib/romaji2kana.c:59:12: error: source file is not valid UTF-8 Log
lordsawar 0.3.1-4armyproto.cpp:37:34: error: array initializer must be an initializer list Log
lv2 1.14.0~dfsg1-2dh_install: missing files, aborting Log
mclibs 20061220+dfsg3-3.1Undetected errorLog
mira 4.9.6-4clang: error: argument to '-V' is missing (expected 1 value) Log
mle 1.3-1Undetected errorLog
mlucas 14.1-2configure: error: in `/<>' Log
mona 1.4-17-1configure: error: C++ compiler not found Log
mongodb 1:3.4.18-2Undetected errorLog
mozjs52 52.9.1-1configure: error: in `/tmp/icu-obj-55qV9B' Log
mpich 3.3-1configure: error: Unable to configure with Fortran support because configure could not determine the size of a Fortran INTEGER. Consider setting CROSS_F77_SIZEOF_INTEGER to the length in bytes of a Fortran INTEGER Log
mrs 6.0.5+dfsg-7Undetected errorLog
myrescue 0.9.8-1Undetected errorLog
nextepc 0.3.10+nods-2Undetected errorLog
nn 6.7.3-10make[2]: *** No rule to make target ' articles.h', needed by 'nn.o'. Stop. Log
norm 1.5.8+dfsg2-1Undetected errorLog
octave-interval 3.2.0-4Undetected errorLog
odb 2.4.0-10../odb/relational/header.hxx:56:24: error: non-const lvalue reference to type 'semantics::data_member' cannot bind to a value of unrelated type 'relational::header::image_member_impl::member_info' (aka 'relational::member_base_impl::member_info') Log
openfoam 4.1+dfsg2-1lnInclude/CrankNicolsonDdtScheme.C:104:1: error: missing 'typename' prior to dependent type template name 'CrankNicolsonDdtScheme::DDt0Field' Log
openhpi 3.8.0-2ipmi.cpp:1561:83: error: alias must point to a defined variable or function Log
openjade 1.4devel1-21.3configure: error: cannot compute sizeof (size_t) Log
openmpi 3.1.3-9configure: error: Cannot continue Log
openmsx 0.15.0-2src/utils/strCat.hh:424:8: error: 'auto' return without trailing return type; deduced return types are a C++14 extension Log
openmsx-catapult 0.15.0-1Undetected errorLog
openvpn-auth-ldap 2.0.3-6.1configure: error: Can't locate Objective C runtime headers Log
paw 1:2.14.04.dfsg.2-9.1Undetected errorLog
pcp 4.3.0-1access.o: r .L.str.1 : Error: additional symbol Log
prime-phylo 1.0.11-7ODESolver.hh:359:20: error: in-class initializer for static data member of type 'const beep::Real' (aka 'const double') requires 'constexpr' specifier [-Wstatic-float-init] Log
primus 0~20150328-7./gl-passthru.def:2:1: error: ifunc must point to a defined function Log
psi 1.3-5Undetected errorLog
pymol 2.2.0+dfsg-4contrib/champ/champ.c:2787:3: error: unterminated function-like macro invocation Log
python-enable 4.5.1-4Undetected errorLog
python-scipy 1.1.0-2Undetected errorLog
qbrew 0.4.1-8Undetected errorLog
qca2 2.1.3-2sh: 1: error: Problems running dot: exit code=127, command='dot', arguments='"/<>/build-qt5/apidocs/html/classQCA_1_1DSAPrivateKey__coll__graph.dot" -Tpng -o "/<>/build-qt5/apidocs/html/classQCA_1_1DSAPrivateKey__coll__graph.png"' Log
qtop 2.3.4-2File.h:327:18: error: qualified reference to 'File' is a constructor name rather than a type in this context Log
quickfix 1.14.4+dfsg-1Undetected errorLog
regina-normal 5.1-6sequence.h:563:8: error: missing 'typename' prior to dependent type template name 'LightweightSequence::SubsequenceCompareFirstPtr' Log
ring 20181001.4.a99aaec~ds6-2configure: error: dbus does not compile when clang is used, rerun with --without-dbus Log
sagemath 8.4-4Undetected errorLog
samba 2:4.9.4+dfsg-1Undetected errorLog
scalapack 2.0.2-7Undetected errorLog 710395
showq 0.4.1+git20161215~dfsg0-3Undetected errorLog
sks-ecc 0.93-6tfm/mpi.c:2565:15: error: unknown register name '%cc' in asm Log
soundmodem 0.20-5../matlib/mat.hh:452:6: error: assigning to 'unsigned int *' from incompatible type 'void *' Log
sparse 0.5.2-2+/usr/include/stdio.h:27:11: error: unable to open 'bits/libc-header-start.h' Log
speedcrunch 0.12.0-4Undetected errorLog
stdsyslog 0.03.3-1stdsyslog.c:560:121: error: format specifies type 'void *' but the argument has type 'char *' [-Werror,-Wformat-pedantic] Log
stx-btree 0.9-2WTreeDrawing.cpp:77:30: error: typedef 'btree_impl' cannot be referenced with a class specifier Log
styx 2.0.1-1sysbase1.c:579:50: error: invalid token at start of a preprocessor expression Log
swi-prolog 7.7.25+dfsg-3Undetected errorLog
t50 5.8.3-1Undetected errorLog
thin-provisioning-tools 0.7.4-2Undetected errorLog
tpb 0.6.4-11Undetected errorLog
transfermii 1:0.6.1-3wiimotefunctions.c:41:10: error: cannot compile this static initializer yet Log
troffcvt 1.04-24Undetected errorLog
varnish-modules 0.15.0-1Undetected errorLog
vboot-utils 0~R63-10032.B-3Undetected errorLog
websocketpp 0.8.1-1clang: error: no input files Log
wmaker 0.95.8-3Undetected errorLog
wvdial 1.61-5uniconfgen.h:323:19: error: no class named 'Iter' in 'UniConfGen' Log
wvstreams 4.6.1-14./include/wvscatterhash.h:186:46: error: invalid use of non-static data member 'xstatus' Log
xbase64 3.1.2-13dpkg-gensymbols: error: some symbols or patterns disappeared in the symbols file: see diff output below Log
xcftools 1.0.7-6Undetected errorLog
xmlcopyeditor 1.2.1.3-3myipc.cpp:49:4: error: cannot initialize a member subobject of type 'WXWidget' (aka '_GtkWidget *') with an rvalue of type 'wxIntPtr' (aka 'long') Log
xmms2 0.8+dfsg-18.1coll.h:615:6: error: binding value of type 'const Xmms::Coll::Coll' to reference to type 'Xmms::Coll::Coll' drops 'const' qualifier Log
xmpi 2.2.3b8-13.2configure: error: cannot continue -- cannot find Log
yodl 4.02.00-3process/processall.cc:29:15: error: fallthrough attribute is only allowed on empty statements Log
yrmcds 1.1.8-1.1Undetected errorLog
z80ex 1.1.21-1dh_install: missing files, aborting Log
zeitgeist 1.0.1-0.2controller.cpp:131:19: error: cannot cast from type 'gboolean (ZeitgeistFTS::Controller::*)()' to pointer type 'GSourceFunc' (aka 'int (*)(void *)') Log
zypper 1.14.11-1Exception.h:329:58: error: template parameter redefines default argument Log
194 errors
Return to the list