Debian Package rebuild

Rebuild of the Debian archive with clang

"Cannot find member in the struct" build failure(s)
clang 3.1
Return to the list

Versions: 2.9 - 3.0 - 3.1 - 3.2 - 3.3 - 3.4 - 3.4.2 - 3.5.0 - 3.6.0 - 3.8.1
PackageVersionSupposed error messageFull log Bug report
freefem3d 1.0pre10-3.1../solver/ConformTransformation.hpp:590:15: error: no member named 'gaussPivot' in the global namespace Log
imageshack-uploader 2.2+hg20100408.d802dea89428-5qtsingleapplication/qtlocalpeer.cpp:103:56: error: no member named 'getuid' in the global namespace Log
libmemcached 1.0.8-1cstdlib:118:11: error: no member named 'malloc' in the global namespace Log
qmf 1.0.7~2011w23.2-2messageserver.cpp:473:7: error: no member named 'write' in the global namespace Log
radare2 0.9-3p/io_procpid.c:115:7: error: no member named '__printf_chk' in 'struct r_io_t' Log
wfmath 0.3.12-3./stream.h:305:16: error: no member named 'm_poly' in 'WFMath::Polygon<2>' Log
6 errors
Return to the list