Debian Package rebuild

Rebuild of the Debian archive with clang

"Cannot find member in the struct" build failure(s)
clang 3.8.1
Return to the list

Versions: 2.9 - 3.0 - 3.1 - 3.2 - 3.3 - 3.4 - 3.4.2 - 3.5.0 - 3.6.0 - 3.8.1
PackageVersionSupposed error messageFull log Bug report
aegisub 3.2.2+dfsg-3util.cpp:30:2: error: no member named 'this_thread' in namespace 'std'; did you mean 'boost::this_thread'? Log
cgit 1.0+git2.8.3-3../filter.c:387:10: error: no member named '__fprintf_chk' in 'struct cgit_filter' Log
cyphesis-cpp 0.6.0-5stream.h:306:19: error: no member named 'm_poly' in 'WFMath::Polygon<2>' Log
dune-grid 2.4.1-1tuple:483:68: error: no member named 'value' in 'std::__and_ &&> >' Log
ext3grep 0.10.2-3./is_blockdetection.h:46:33: error: no member named 'memset' in namespace 'std'; did you mean simply 'memset'? Log 755542
gridengine 8.1.9+dfsg-1../libs/gdi/sge_gdi_ctx.c:1054:19: error: no member named '__dprintf_chk' in 'struct sge_csp_path_class_str' Log
gringo 4.5.4-3tuple:483:68: error: no member named 'value' in 'std::__and_ &&> >' Log
k3b 2.0.3a-2k3bffmpegwrapper.cpp:141:17: error: no member named 'av_open_input_file' in the global namespace Log
kodi-pvr-hdhomerun 1.0.12+git20160316-1HDHomeRunTuners.cpp:43:25: error: no member named 'hash' in namespace 'std' Log
kodi-pvr-wmc 0.6.15+git20160301-1pvr2wmc.cpp:315:27: error: no member named 'unique_ptr' in namespace 'std' Log
libnftnl 1.0.6-1rule.c:778:20: error: no member named '__builtin___snprintf_chk' in 'struct expr_ops' Log 755956
meep 1.3-4cstdlib:124:9: error: no member named 'div_t' in the global namespace; did you mean '::meep::div_t'? Log
meep-lam4 1.3-2cstdlib:124:9: error: no member named 'div_t' in the global namespace; did you mean '::meep::div_t'? Log
meep-mpi-default 1.3-3cstdlib:124:9: error: no member named 'div_t' in the global namespace; did you mean '::meep::div_t'? Log
meep-mpich2 1.3-4cstdlib:124:9: error: no member named 'div_t' in the global namespace; did you mean '::meep::div_t'? Log
meep-openmpi 1.3-3cstdlib:124:9: error: no member named 'div_t' in the global namespace; did you mean '::meep::div_t'? Log
mercator 0.3.3-4polygon_intersect.h:667:37: error: no member named 'm_orient' in 'WFMath::Polygon<2>' Log
openipmi 2.0.22-1ipmi_sim.c:612:11: error: no member named '__printf_chk' in 'struct emu_out_s' Log
pytango 8.1.8-2callback.cpp:276:17: error: no member named 'move' in namespace 'std' Log
spring 103.0+dfsg-1tuple:483:68: error: no member named 'value' in 'std::__and_ &&> >' Log
vtk6 6.3.0+dfsg1-1cstdlib:124:11: error: no member named 'div_t' in the global namespace; did you mean 'dev_t'? Log
xplanet 1.3.0-4cstdlib:124:9: error: no member named 'div_t' in the global namespace; did you mean '::sgp4sdp4::div_t'? Log
22 errors
Return to the list