Debian Package rebuild

Rebuild of the Debian archive with clang

"Cannot find member in the struct" build failure(s)
clang 3.3
Return to the list

Versions: 2.9 - 3.0 - 3.1 - 3.2 - 3.3 - 3.4 - 3.4.2 - 3.5.0 - 3.6.0 - 3.8.1
PackageVersionSupposed error messageFull log Bug report
dacs 1.4.27b-2mod_auth_dacs.c:1295:10: error: no member named 'remote_ip' in 'struct conn_rec' Log
digikam 4:2.6.0-1kprawthumbthread.cpp:112:32: error: no member named 'loadDcrawPreview' in 'KDcrawIface::KDcraw'; did you mean 'loadRawPreview'? Log
ext3grep 0.10.1-3.2./is_blockdetection.h:46:38: error: no member named 'memset' in namespace 'std'; did you mean 'wmemset'? Log 755542
freefem3d 1.0pre10-3.1../solver/ConformTransformation.hpp:590:15: error: no member named 'gaussPivot' in the global namespace Log
gst-plugins-good0.10 0.10.31-3+nmu1gstv4l2bufferpool.c:184:67: error: no member named 'input' in 'struct v4l2_buffer' Log
kde-workspace 4:4.8.4-6powermanagementfdoadaptor.cpp:45:22: error: no member named 'CanHybridSuspend' in 'PowerDevil::FdoConnector' Log
libmemcached 1.0.8-1cstdlib:140:11: error: no member named 'malloc' in the global namespace Log
mod-gnutls 0.5.10-1.1gnutls_hooks.c:753:9: error: no member named 'remote_addr' in 'struct conn_rec' Log
mplayer 2:1.0~rc4.dfsg1+svn34540-1libmpdemux/demux_rtp.cpp:99:20: error: no member named 'describeWithPassword' in 'RTSPClient' Log
mupdf 1.2-2fitz/stm_output.c:42:13: error: no member named '__printf_chk' in 'struct fz_output_s' Log 755741
netexpect 0.20-3tcl_packet.c:137:30: error: no member named 'del_cap_ts' in 'struct _frame_data' Log
openclonk 5.3.3-1StdBuf.h:63:14: error: no member named 'move' in namespace 'std' Log
radare2 0.9-3p/io_procpid.c:115:7: error: no member named '__printf_chk' in 'struct r_io_t' Log
sqliteodbc 0.992-2zipfile.c:1886:5: error: no member named '__builtin___snprintf_chk' in 'struct sqlite3_api_routines' Log
vdr-plugin-xine 0.9.4-7xineDevice.c:1203:36: error: no member named 'PmtPid' in 'cPatPmtParser' Log
wfmath 0.3.12-3./stream.h:305:16: error: no member named 'm_poly' in 'WFMath::Polygon<2>' Log
zeroc-ice 3.4.2-8.3FileUtil.cpp:401:14: error: no member named 'rmdir' in the global namespace Log
17 errors
Return to the list