Debian Package rebuild

Rebuild of the Debian archive with clang

"Cannot find member in the struct" build failure(s)
clang 3.2
Return to the list

Versions: 2.9 - 3.0 - 3.1 - 3.2 - 3.3 - 3.4 - 3.4.2 - 3.5.0 - 3.6.0 - 3.8.1
PackageVersionSupposed error messageFull log Bug report
ext3grep 0.10.1-3.2./is_blockdetection.h:46:38: error: no member named 'memset' in namespace 'std'; did you mean 'wmemset'? Log 755542
freefem3d 1.0pre10-3.1../solver/ConformTransformation.hpp:590:15: error: no member named 'gaussPivot' in the global namespace Log
kamailio 3.3.0-1dns_cache.c:3891:7: error: no member named '__printf_chk' in 'struct rpc' Log 755852
openclonk 5.3.2-1StdBuf.h:63:14: error: no member named 'move' in namespace 'std' Log
radare2 0.9-3p/io_procpid.c:115:7: error: no member named '__printf_chk' in 'struct r_io_t' Log
turnserver 0.7.2-1protocol.c:84:10: error: no member named 's6_addr32' in 'struct in6_addr' Log
zeroc-ice 3.4.2-8.1FileUtil.cpp:401:14: error: no member named 'rmdir' in the global namespace Log
7 errors
Return to the list