Debian Package rebuild

Rebuild of the Debian archive with clang

"Cannot find member in the struct" build failure(s)
clang 3.6.0
Return to the list

Versions: 2.9 - 3.0 - 3.1 - 3.2 - 3.3 - 3.4 - 3.4.2 - 3.5.0 - 3.6.0 - 3.8.1
PackageVersionSupposed error messageFull log Bug report
cgit 0.10.2.git2.0.1-3../filter.c:385:10: error: no member named '__fprintf_chk' in 'struct cgit_filter' Log
cyphesis-cpp 0.6.0-3stream.h:306:19: error: no member named 'm_poly' in 'WFMath::Polygon<2>' Log
ext3grep 0.10.1-3.2./is_blockdetection.h:46:33: error: no member named 'memset' in namespace 'std'; did you mean simply 'memset'? Log 755542
libnftnl 1.0.3-4rule.c:806:20: error: no member named '__builtin___snprintf_chk' in 'struct expr_ops' Log 755956
mercator 0.3.2-1.1polygon_intersect.h:667:37: error: no member named 'm_orient' in 'WFMath::Polygon<2>' Log
openjfx 8u40-b25-1../../../../src/main/native/Source/WTF/wtf/RefPtr.h:157:30: error: no member named 'move' in namespace 'std' Log
6 errors
Return to the list