Debian Package rebuild

Rebuild of the Debian archive with clang

"Expected declaration (#define missing?)" build failure(s)
clang 3.0
Return to the list

Versions: 2.9 - 3.0 - 3.1 - 3.2 - 3.3 - 3.4 - 3.4.2 - 3.5.0 - 3.6.0 - 3.8.1
PackageVersionSupposed error messageFull log Bug report
aqualung 0.9~beta11-1.2gui_main.c:3237:60: error: expected ';' at end of declaration Log 746195
auto-multiple-choice 1.0.3-1AMC-traitement-image.c:228:28: error: expected ';' at end of declaration Log 746196
autounit 0.20.1-3.1test.c:305:7: error: expected expression Log 755961
bogl 0.1.18-5bogl-font.c:83:23: error: expected ';' at end of declaration Log 758063
calcurse 2.9.2-1io.c:1400:3: error: expected ';' at end of declaration Log
chillispot 1.0-10.1redir.c:1399:21: error: expected ';' at end of declaration Log
clearsilver 0.10.5-1.3neo_files.c:219:12: error: expected expression Log 755963
clutter-gesture 0.0.2.1-5stroke.c:194:43: error: expected ';' at end of declaration Log
dietlibc 0.33~cvs20111108-5:2:23: error: expected '@' or '%' before type Log
eurephia 1.0.1-3eurephiadm.c:203:46: error: expected ';' at end of declaration Log
filters 2.48cockney.l:21:12: error: expected ';' at end of declaration Log 758450
frozen-bubble 2.2.0-2fb_c_stuff.xs:99:23: error: expected ';' at end of declaration Log
gmysqlcc 0.3.0-2gmlc_gui_server_tab_data.c:678:82: error: expected ';' at end of declaration Log 750365
gosmore 0.0.0.20100711-2libgosm.cpp:147:53: error: expected ')' Log 756077
gpe-calendar 0.92-4calendars-widgets.c:711:38: error: expected ';' at end of declaration Log
ivtools 1.2.8a1-7src/Attribute/attrvalue.cc:555:26: error: expected ')' Log
kdegames 4:4.6.5-1../../libkdegames/kgamerenderer.h:211:143: error: expected ')' Log
knights 2.3.2-1kgamerenderer.h:211:143: error: expected ')' Log
kraptor 0.0.20040403-6src/game.c:415:32: error: expected ';' at end of declaration Log 750370
lasso 2.3.5-4tools.c:1208:76: error: expected ';' at end of declaration Log
libeventdb 0.90-5event-db.c:538:33: error: expected ';' at end of declaration Log
libgpevtype 0.50-6vcal.c:43:35: error: expected ';' at end of declaration Log
libhandoff 0.1-5handoff.c:257:21: error: expected ';' at end of declaration Log
libspf2 1.2.9-4spf_compile.c:580:5: error: expected expression Log
libsx 2.05-3popups.c:70:44: error: expected ';' at end of declaration Log 758560
luvcview 1:0.2.6-5v4l2uvc.c:197:29: error: expected ';' at end of declaration Log 750506
matchbox-panel 0.9.3-5mb-applet-battery.c:181:41: error: expected ';' at end of declaration Log 750784
mawk 1.3.3-16print.c:85:11: error: expected parameter declarator Log
mcdp 0.4-5cddev.c:61:37: error: expected ';' at end of declaration Log
mutrace 0.2.0-2libiberty.h:612:12: error: expected parameter declarator Log
ncpfs 2.2.6-8ncplib.c:2424:51: error: expected ';' at end of declaration Log
netplug 1.2.9.2-1if_info.c:294:36: error: expected ';' at end of declaration Log 750789
p3scan 2:2.3.2-7p3scan.c:2410:83: error: expected ';' at end of declaration Log 750874
partconf 1.37util.c:147:50: error: expected ';' at end of declaration Log
pdp 1:0.12.5-1.1pdp_xwindow.c:148:23: error: expected ';' at end of declaration Log 758569
qsapecng 2.0.0-4parser.h:78:41: error: expected ')' Log
qxw 20110923-1dicts.c:288:42: error: expected ';' at end of declaration Log
rainbow 0.8.6-1nss-rainbow.c:287:38: error: expected ';' at end of declaration Log 758571
rawstudio 2.0-1rs-tag-gui.c:102:102: error: expected ';' at end of declaration Log
rsh-redone 85-1rlogin.c:388:29: error: expected ';' at end of declaration Log 750957
sdl-ball 1.01-1main.cpp:1423:77: error: expected member name or ';' after declaration specifiers Log
sentinella 0.9.0-3MainWindow.h:70:33: error: expected ';' at end of declaration list Log
smbc 1.2.2-3smbc.c:315:38: error: expected ';' at end of declaration Log
spl 1.0~pre6-3spl_modules/mod_format_xml.c:187:19: error: expected ';' at end of declaration Log 741605
taxbird 0.16-0.2main.c:75:46: error: expected ';' at end of declaration Log
visualboyadvance 1.8.0.dfsg-0.1debugger.cpp:1725:36: error: expected ')' Log
xfe 1.32.4-3xfeutils.cpp:478:24: error: expected ')' Log
xmlcopyeditor 1.2.0.6-2./housestyle.h:76:20: error: expected member name or ';' after declaration specifiers Log
48 errors
Return to the list