Debian Package rebuild

Rebuild of the Debian archive with clang

"Not categorized" build failure(s)
clang 2.9
Return to the list

Versions: 2.9 - 3.0 - 3.1 - 3.2 - 3.3 - 3.4 - 3.4.2 - 3.5.0 - 3.6.0 - 3.8.1 - 3.9.1 - 4.0.1 - 5.0
PackageVersionSupposed error messageFull log Bug report
a7xpg 0.11.dfsg1-6Undetected errorLog
abraca 0.6.0-3/bin/sh: 1: git: not found Log
acl2 4.2-1Undetected errorLog
aconnectgui 0.9.0rc2-1-9configure: error: Sufficiently new version of libasound not found. Log 684508
activemq-protobuf 1.1-1Undetected errorLog
aegis 4.24.3-2Undetected errorLog
aeskulap 0.2.2b1-8aclocal.m4:14: error: this file was generated for autoconf 2.61. Log
agave 0.4.7-1refptr.h:208:16: error: member access into incomplete type 'gcs::PaletteTreeModel' Log
amanda 1:3.2.1-1.1Undetected errorLog
ant-contrib 1.0~b3+svn177-3Undetected errorLog
antlr-maven-plugin 2.1-1Undetected errorLog
antlr3 3.2-5Undetected errorLog
aplus-fsf 4.22.1-4../MSTypes/MSFloatMatrix.H:30:1: error: template specialization requires 'template<>' Log
apron 0.9.10-5.2ppl.hh:14384:15: error: flexible array member 'vec_' of non-POD element type 'Coefficient []' Log
aptitude 0.6.4-1../../../../../src/generic/util/immset.h:116:90: error: template non-type parameter has a different type 'const int' in template redeclaration Log
aqemu 0.8.2-1VM.cpp:4566:75: error: reference to type 'const QString' could not bind to an rvalue of type 'bool' Log
arj 3.10.22-10Undetected errorLog
armagetronad 0.2.8.3.1-1../../src/tools/tDirectories.cpp:502:26: error: uninitialized const 'st_Config' [-fpermissive] Log
arpon 2.0-2Undetected errorLog
ascii2binary 2.13-1waitstatus.h:80:15: error: duplicate member '__w_retcode' Log
asterisk-espeak 0.1-1unsatisfiable build-dependency: asterisk-dev (< 1:1.6.3) but 1:1.8.4.4~dfsg-2 is to be installed Log
asterisk-flite 0.1~beta2-1unsatisfiable build-dependency: asterisk-dev (< 1:1.6.3) but 1:1.8.4.4~dfsg-2 is to be installed Log
atom4 4.1-5.1engine/ai.cc:343:1: error: control reaches end of non-void function [-Werror,-Wreturn-type] Log 710408
autoclass 3.3.6-1/bin/sh: 1: ps2pdf: not found Log
autofs 4.1.4+debian-3Undetected errorLog 757038
autofs5 5.0.4-3.2Undetected errorLog
automake1.10 1:1.10.3-1Undetected errorLog
automake1.11 1:1.11.1-1Undetected errorLog
avifile 1:0.7.48~20090503.ds-7common/avm_output.cpp:20:12: error: qualified reference to 'AvmOutput' is a constructor name rather than a type wherever a constructor can be declared Log
ax25-tools 0.0.8-13.1./rip98d.h:47:12: error: restrict requires a pointer or reference Log
azureus 4.3.0.6-4Undetected errorLog
babl 0.0.22-1sse-fixups.c:93:16: error: use of unknown builtin '__builtin_ia32_movhlps' Log
ball 1.4.0-4global.h:46:38: error: token is not a valid binary operator in a preprocessor subexpression Log 755225
banshee 2.0.1-4./Banshee.Dap.AppleDevice/AppleDeviceTrackInfo.cs(218,19): error CS0266: Cannot implicitly convert type `int' to `uint'. An explicit conversion exists (are you missing a cast?) Log
batik 1.7-7Undetected errorLog
beanstalkd 1.4.6-3./tube.h:38:16: error: field 'buried' with variable sized type 'struct job' not at the end of a struct or class is a GNU extension [-Werror,-Wgnu] Log
bin-prot 1.3.1-3Undetected errorLog
bind9 1:9.7.3.dfsg-1configure: error: could not find Berkeley DB include directory Log
binutils 2.21.53.20110910-1Undetected errorLog
binutils-avr 2.20.1-2Undetected errorLog
binutils-h8300-hms 2.16.1-8Undetected errorLog
binutils-mingw-w64 0.3Undetected errorLog
binutils-z80 2.21.52-2unsatisfiable build-dependency: binutils-source (< 2.21.53) but 2.21.53.20110910-1 is to be installed Log
blacs-mpi 1.1-30.1blacsF77init_MPI-LINUX-0.a: could not read symbols: Archive has no index; run ranlib to add one Log
blas 1.2.20110419-2Undetected errorLog
bomstrip 9-6Undetected errorLog
boxbackup 0.11~rc8~r2714-1stdlib.h:896:12: error: exception specification in declaration does not match previous declaration Log
bridge-method-injector 1.4-1Undetected errorLog
build-helper-maven-plugin 1.5-1Undetected errorLog
busybox 1:1.18.5-1findutils/find.c:752:2: error: illegal storage class on function Log
cheesetracker 0.9.15.3-4debug.h:49:13: error: inline namespace cannot be reopened as non-inline Log
chicken 4.7.0-1Undetected errorLog
chromium-browser 13.0.782.220~r99552-1third_party/skia/src/core/SkBitmap.cpp:1208:57: error: restrict requires a pointer or reference ('uint8_t' (aka 'unsigned char') is invalid) Log
clamav 0.97.2+dfsg-1Undetected errorLog
classads 1.0.10-2Undetected errorLog
clojure 1.1.0+dfsg-2Undetected errorLog
clojure-maven-plugin 1.3.3-2Undetected errorLog
clojure1.2 1.2.1+dfsg-3Undetected errorLog
cmake 2.8.5-1Undetected errorLog
cobertura-maven-plugin 2.3+dfsg-1Undetected errorLog
coinor-flopc++ 1.0.6-3.1./MP_domain.hpp:180:18: error: return type of virtual function 'getSet' is not covariant with the return type of the function it overrides ('flopc::MP_set_base' is incomplete) Log
composite 0.006.2-1PatternEditorInstrumentList.cpp:163:42: error: member access into incomplete type '::Mixer' Log
console-setup 1.73Undetected errorLog
cook 2.33-1Undetected errorLog
coriander 2.0.1-1configure: error: The XV overlay libraries were not found Log
cpptasks 1.0~b5-1Undetected errorLog
cpuburn 1.4a-2cc-v20Zjx.s:59:13: error: invalid operand for instruction Log
crash 5.1.7-3Undetected errorLog
crtmpserver 0.0~dfsg+svn474-1Undetected errorLog
cryptonit 0.9.7-2.4pkcs7.cpp:231:23: error: 'EVP_md2' was not declared in this scope Log
ctdb 1.10+git20110722-1Undetected errorLog
dansguardian 2.10.1.1-3configure: error: Package requirements (libclamav >= 4) were not met: Log
darktable 0.9.2-1colormatrices.c:31:34: error: unused variable 'dt_profiled_colormatrices' [-Werror,-Wunused-variable] Log
db4.7 4.7.25-21configure: error: Unable to build RPC support: rpcgen failed. Log
dbus-java 2.8-1/bin/sh: 1: /usr/lib/jvm/java-6-openjdk/bin/javac: not found Log
deal.ii 7.0.0-2configure: error: No threading compiler options for this C++ compiler specified at present Log
derivations 0.52.20100310-1unsatisfiable build-dependency: texlive-base-bin (>= 2005) (versioned dep on a virtual pkg?) Log
dico 2.1-3Undetected errorLog
dietlibc 0.32-5.2cc-AdgInd.s:45:14: error: unexpected token in '.macro' directive Log
diffutils 1:3.0-1Undetected errorLog
digikam 2:1.9.0-3iccmanager.h:126:88: error: type 'const Digikam::IccProfile' does not provide a call operator Log
discount 2.1.1.3-1Undetected errorLog
dmapi 2.2.10-1Undetected errorLog
docbook-defguide 2.0.17+svn7549-3Undetected errorLog
dojo 1.6.1+dfsg-1Undetected errorLog
dolfin 1.0-beta-1ErrorControl.h:179:48: error: no function named 'adapt' with type 'const dolfin::ErrorControl &(const dolfin::ErrorControl &, boost::shared_ptr)' was found in the specified scope Log
doxia-maven-plugin 1.1.1-3Undetected errorLog
drac 1.12-7.1Undetected errorLog
dracut 013-1make[1]: xsltproc: Command not found Log
drift 2.2.3-2/bin/bash: ghc6: command not found Log
drizzle 2011.03.13-1drizzled/cursor.cc:1402:8: error: unknown flag Log
dsniff 2.4b1+debian-21Undetected errorLog
dumbster 1.6+debian-1Undetected errorLog
dvdisaster 0.72.1-2Undetected errorLog
eclipse 3.5.2-11Undetected errorLog
edbrowse 3.4.1-1jsloc.c:48:6: error: indirection requires pointer operand ('jsdouble' (aka 'double') invalid) Log
edict-fpw 1.2.1-8Undetected errorLog
ehcache 2.1.0-1 [javac] SyncTransaction.java:66: cannot find symbol Log
eigen2 2.0.16-2Undetected errorLog
electric 8.10-1Undetected errorLog
electricsheep 2.7~b12+svn20091224-1electricsheep.c:673:6: error: 'CODEC_TYPE_VIDEO' undeclared (first use in this function) Log
elfsign 0.2.2-2configure: error: required openssl library missing Log
elfutils 0.152-1elf_begin.c:632:23: error: comparison of integers of different signs: '__off_t' (aka 'long') and 'size_t' (aka 'unsigned long') [-Werror,-Wsign-compare] Log 758064
enigma 1.10~~pre-alpha+r2210-1./ecl_dict.hh:134:27: error: calling a private constructor of class 'ecl::XInvalidKey' Log
erlang 1:14.b.3-dfsg-2drivers/common/inet_drv.c:3457:7: error: #error LIBSCTP not defined Log
estic 1.61-20./coll.h:317:7: error: invalid operands to binary expression ('Stream' and 'u32' (aka 'unsigned int')) Log
etsf-io 1.0.3-3configure: error: "No 'NetCDF' library found." Log
eucalyptus 1.6.2-2configure: error: Cannot find java! Log
evolution-data-server 2.32.3-1configure: error: libgdata 0.7 is not supported, use 0.6 instead Log
evolvotron 0.6.1-1Undetected errorLog
exec-maven-plugin 1.1.1+dfsg-2Undetected errorLog
exo 0.6.2-2Undetected errorLog
ext3grep 0.10.1-3.1Undetected errorLog 755542
extundelete 0.2.0-1extundelete.cc:963:45: error: subscript of pointer to incomplete type 'struct opaque_ext2_group_desc' Log
fcode-utils 1.0.2-3clang: error: unable to execute command: Aborted Log
fdm 1.6-4unsatisfiable build-dependency: tdb-dev (>= 1.1.1~svn26294-1.1) (versioned dep on a virtual pkg?) Log
feel++ 0.91.0~svn7215-3Undetected errorLog
fex 20110726-1Undetected errorLog
fileschanged 0.6.5-1.1monitor.c:73:7: error: variable 'retval' set but not used [-Werror=unused-but-set-variable] Log
filtergen 0.12.4-5resolver.c:46:11: error: variable 'm' set but not used [-Werror=unused-but-set-variable] Log 751443
firebird2.1 2.1.4.18393-0.ds2-2../src/include/../common/classes/alloc.h:435:14: error: exception specification in declaration does not match previous declaration Log
flexml 1.8-1.1Undetected errorLog
fltk1.1 1.1.10-7Undetected errorLog 755228
fontmatrix 0.6.0+svn20100107-2Undetected errorLog
fracplanet 0.4.0-1.1Undetected errorLog
freecol 0.10.0+dfsg-2Undetected errorLog
freefem++ 3.13.3-1../fflib/AFunction.hpp:2612:14: error: allocation of incomplete type 'E_F1_funcT_Type' Log
freehep-chartableconverter-plugin 2.0-5Undetected errorLog
freej 0.10git20100110-1configure: error: *** bindings requested but swig not found! Log
freemind 0.9.0+dfsg-1/bin/sh: 1: /bin/java: not found Log
freeplane 1.1.3-1Undetected errorLog
ftgl 2.1.3~rc5-3Undetected errorLog
fwbuilder 4.2.2-1CompilerDriver_ipt_run.cpp:655:16: error: invalid operands to binary expression ('QTextStream' and '') Log
galeon 2.0.7-2.1configure: error: Package requirements (libxul-embedding-unstable >= 1.9) were not met: Log
garcon 0.1.8-1Undetected errorLog
gauche 0.9.1-5 Log
gauche-gtk 0.4.1-13configure.in:10: error: possibly undefined macro: AC_GAUCHE_INIT_EXT Log
gbirthday 0.6.4-4Undetected errorLog
gbsplay 0.0.91-1Undetected errorLog
gcal 3.6.0-1Undetected errorLog
gcc-3.3 1:3.3.6ds1-24Undetected errorLog
gcc-4.4 4.4.6-10Undetected errorLog
gcc-4.5 4.5.3-8Undetected errorLog
gcc-4.6 4.6.1-10Undetected errorLog
gcc-h8300-hms 1:3.4.6-6./gtype-cp.h:431:14: error: duplicate case value '0' Log
gcc-mingw-w64 0.3./genfixes: 1: ./genfixes: autogen: not found Log
gcc-mingw32 4.4.4-1Undetected errorLog
gcj-4.4 4.4.6-10Undetected errorLog
gcj-4.6 4.6.1-4Undetected errorLog
gclcvs 2.7.0-101configure: error: Cannot use dynamic gmp lib Log
gcolor2 0.4-2Undetected errorLog
gcompris 9.3-1.2goocanvas.c:1370:5: error: array index of '1' indexes past the end of an array (that contains 1 elements) [-Werror,-Warray-bounds] Log
gdb-avr 7.2-1Undetected errorLog
gdb-mingw-w64 0.1Undetected errorLog
gdc-4.4 1.063-4.4.6-6Undetected errorLog
gearman-interface 0.13.2-2Undetected errorLog
gedit-valencia-plugin 0.3.0-2Undetected errorLog
generatorrunner 0.6.12-2Undetected errorLog
geronimo-ejb-3.0-spec 1.0.1-1 [javac] EJBContext.java:60: cannot find symbol Log
gettext 0.18.1.1-4Undetected errorLog
gfarm 2.4.1-1../../../libtool: 1: eval: base_compile+= -c: not found Log
gforth 0.7.0+ds1-6make[1]: emacs: Command not found Log
ggz-python 0.0.14.1-1configure: error: The RSVG library is not or incompletely installed. Log
gkrelltop 2.2.13-1Errors while processing: gkrellmd sbuild-build-depends-gkrelltop-dummy Log
gltron 0.70final-9scripting.c:159:15: error: variable 'copy' set but not used [-Werror=unused-but-set-variable] Log
gmerlin 1.0.0~dfsg-7bgyadif.c:777:7: error: ambiguous instructions require an explicit suffix (could be 'cmpb', 'cmpw', 'cmpl', or 'cmpq') Log
gmpc 0.20.0-2gmpc.vapi:1.7-1.25: error: The namespace name `Gmpc.PanedSizeGroup' could not be found Log
gnash 0.8.10~git20110618-3../../libmedia/ffmpeg/AudioDecoderFfmpeg.cpp:553:52: error: 'avcodec_decode_audio2' was not declared in this scope Log
gnat-4.4 4.4.6-5Undetected errorLog
gnucap 1:0.36~20091207-1./mg_.h:134:19: error: variable has incomplete type 'C_Comment' Log
golang 1:59-1Undetected errorLog
golang-weekly 2011.08.10-1Undetected errorLog
goplay 0.4-1engine.h:153:24: error: calling a protected constructor of class 'wibble::commandline::OptionGroup' Log 753645
gpa 0.9.0-1Undetected errorLog
gpib 3.2.11-2.1Undetected errorLog
gprolog 1.3.0-6.1Undetected errorLog
gpsbabel 1.4.2-3Undetected errorLog
gradle 1.0~m3-1Undetected errorLog
granule 1.3.0-1Granule.cpp:58:1: error: extraneous 'template<>' in declaration of variable 'm_default_entity_loader' Log
graphicsmagick 1.3.12-1.1Undetected errorLog
graphite2 1.0.2-1Undetected errorLog
grep 2.9-2Undetected errorLog
gtest 1.6.0-1Undetected errorLog
guile-1.8 1.8.8+1-6async.c:243:14: error: variable 'count' set but not used [-Werror=unused-but-set-variable] Log
guile-gnome-platform 2.16.1-6Undetected errorLog
gunroar 0.15.dfsg1-4Undetected errorLog
guppy 0.1.9-2ImportError: guppy/sets/setsc.so: undefined symbol: _PyLong_AsScaledDouble Log
guymager 0.5.9-1./fifo.h:79:24: error: field has incomplete type 'unsigned char []' Log
gxemul 0.6.0-2CPUDyntransComponent.cc:112:15: error: assigning to 'void (*)(CPUDyntransComponent *, DyntransIC *)' from incompatible type 'void (*)(CPUDyntransComponent *, DyntransIC *) const' Log
gxneur 0.12.0-1misc.c:87:20: error: unused variable 'all_modifiers' [-Werror,-Wunused-variable] Log
hamlib 1.2.14-1Undetected errorLog
hardening-wrapper 1.34Undetected errorLog
herbstluftwm 0~git2011.08.28-1Undetected errorLog
htmlcxx 0.85-2Undetected errorLog
hugs98 98.200609.21-5.3tools/make_bootlib: 68: tools/make_bootlib: -D__HUGS__: not found Log
hydrogen 0.9.5-3scons: *** [debian/hydrogen/usr/share/hydrogen/data/img/gray] /build/hydrogen-_Xbmdx/hydrogen-0.9.5/debian/hydrogen/usr/share/hydrogen/data/img/gray: File exists Log
hylafax 2:6.0.5-5Undetected errorLog
ibus-qt 1.3.1-2qibusserializable.h:94:59: error: non-const lvalue reference to type 'QVariant' cannot bind to a temporary of type 'QVariant' Log
ibus-table-chinese 1.3.0.20100527-1Undetected errorLog
ibus-table-others 1.3.0.20100528-1Undetected errorLog
iceape 2.0.14-7unsatisfiable build-dependency: dpkg-dev (<= 1.14.7) but 1.16.0.3 is to be installed Log
icedove 3.1.13-1configure: error: ./configure failed for mozilla Log
icedtea-web 1.1-1configure: error: "A JDK home directory could not be found." Log
iceowl 1.0~b2-6configure: error: ./configure failed for mozilla Log
iceweasel 6.0.2-1Undetected errorLog
icu 4.4.2-2ld: final link failed: Bad value Log
ii-esu 1.0a.dfsg1-3Undetected errorLog
imvirt 0.9.1-1vmware.c:67:5: error: invalid operand for instruction Log
inetutils 2:1.8-3Undetected errorLog
instantbird 1:0.2-1configure: error: /sdk/include/xpcom-config.h doesn't exist Log
invaders 1.0.0-11cc-3WBF4i.s:11:9: error: .code32 not supported yet Log
ipsec-tools 1:0.8.0-3configure: error: cannot use iconv Log
ipsvd 1.0.0-1Undetected errorLog
iptux 0.5.2-1AnalogFS.cpp:160:23: error: assigning to 'struct entry *' from incompatible type 'struct entry *' Log
ipxe 1.0.0+git-2.149b50-1libgcc/libgcc.h:7:8: error: cdecl and stdcall attributes are not compatible Log
ircd-hybrid 1:7.2.2.dfsg.2-6.2Undetected errorLog
isakmpd 20041012-7.1make[1]: *** No rule to make target `/usr/lib/libgmp.a', needed by `isakmpd'. Stop. Log
ivritex 1.1.1-6make[2]: ps2pdf: Command not found Log
jackbeat 0.7.4-1.1main.c:82:45: error: 'REG_RIP' undeclared (first use in this function) Log
jajuk 1:1.9.5-2Undetected errorLog
janest-core 0.6.0-3Undetected errorLog
jasperreports 4.0.2+dfsg-2unsatisfiable build-dependency: libjakarta-poi-java (>= 3.2) (versioned dep on a virtual pkg?) Log
java3d 1.5.2+dfsg-6Undetected errorLog
javacc-maven-plugin 2.6-1Undetected errorLog
javamorph 0.0.20100201-1/bin/sh: 1: /usr/lib/jvm/java-6-openjdk/bin/javac: not found Log
jblas 1.2.0-2Undetected errorLog
jbossas4 4.2.3.GA-5Undetected errorLog
jcal 0.4.0-1Undetected errorLog
jcaptcha 2.0~alpha1-1Undetected errorLog
jcc 2.9-1Undetected errorLog
jcharts 0.7.5-2Undetected errorLog
jed 1:0.99.19-2gcc-4.6.real: error: unrecognized option '-V' Log
jetty 6.1.24-6 [javac] Transaction.java:58: cannot find symbol Log
jeuclid 3.1.9-1Undetected errorLog
jing-trang 20091111-3 [javac] SimpleCatalogManager.java:18: cannot find symbol Log
jmol 12.0.40-1 [javac] JmolAppletRegistry.java:70: cannot find symbol Log
jodconverter 2.2.2-5AbstractOpenOfficeConnection.java:129: cannot find symbol Log
jpoker 1.0.16-2Undetected errorLog
jsymphonic 0.3.0.Ode.To.Freedom+svn387-6Undetected errorLog
jwordsplitter 3.0-1Undetected errorLog
k3d 0.8.0.2-12image_view_factory.hpp:151:43: error: invalid use of incomplete type 'boost::gil::default_color_converter' Log
kazehakase 0.5.8-4configure: error: Package requirements (libxul-embedding-unstable >= 1.9) were not met: Log
kcheckgmail 0.6.0-1Undetected errorLog
kdeaccessibility 4:4.6.5-1componentfactory.h:84:62: error: calling a private constructor of class 'QString' Log
kdebase-workspace 4:4.6.5-2../../../khotkeys/libkhotkeysprivate/action_data/simple_action_data.h:81:15: error: In file included from ../../../khotkeys/libkhotkeysprivate/action_data/menuentry_shortcut_action_data.cpp:20: Log
kdebindings 4:4.4.5-7sipakonadipart6.cpp:1958:16: error: calling a protected destructor of class 'Akonadi::Entity' Log
kdevelop 4:4.2.2-1c++0x_warning.h:32:2: error: #error This file requires compiler and library support for the upcoming ISO C++ standard, C++0x. This support is currently experimental, and must be enabled with the -std=c++0x or -std=gnu++0x compiler options. Log
kdevelop-php 1.2.2-1abstractusebuilder.h:94:5: error: no viable conversion from 'const KDevelop::DUChainPointer' to 'KDevelop::Declaration *' Log
kdiff3 0.9.96-1Undetected errorLog
keepassx 0.4.3-1Undetected errorLog
kerneloops 0.12+git20090217-1.1Undetected errorLog
kicad 0.0.20110616-1clone_allocator.hpp:34:22: error: allocating an object of abstract class type 'LIB_ITEM' Log
kindleclip 0.3-1make[1]: ruby: Command not found Log
knopflerfish-osgi 2.3.3-1Undetected errorLog
komparator 1:0.3-1Undetected errorLog
konq-plugins 4:4.6.1-1qmap.h:107:17: error: invalid operands to binary expression ('const DOM::Node' and 'const DOM::Node') Log
kphotoalbum 4.1.1-4componentfactory.h:84:62: error: calling a private constructor of class 'QString' Log
kplayer 1:0.7-2Undetected errorLog
krusader 1:2.3.0~beta1-1checksumdlg.cpp:53:91: error: default arguments can only be specified for parameters in a function declaration Log
ktoon 0.8.1-4.2ktdualcolorbutton.cpp:161:18: error: taking the address of a temporary object of type 'QBrush' [-Waddress-of-temporary] Log
language-env 0.69Undetected errorLog
ldc 0.9.1+hg1634-1Undetected errorLog
ledger 2.6.2-3.1valexpr.cc:362:9: error: invalid argument type 'ledger::value_t' to unary expression Log
lftp 4.3.1-1Undetected errorLog
libace-perl 1.92-2Undetected errorLog
libafs-perl 2.6.2-1Undetected errorLog
libanyevent-i3-perl 0.07-1Undetected errorLog
libapache2-mod-perl2 2.0.5-2Undetected errorLog
libb-hooks-parser-perl 0.09-1Undetected errorLog
libbio-das-lite-perl 2.04-1Undetected errorLog
libbpp-phyl 2.0.2-1NumTools.h:116:50: error: invalid operands to binary expression ('std::vector >' and 'std::vector >') Log
libcaca 0.99.beta17-2Undetected errorLog
libcairo-ruby 1.8.1-1Undetected errorLog
libcanberra 0.28-1unsatisfiable build-dependency: tdb-dev (> 1.1) (versioned dep on a virtual pkg?) Log
libclutter-perl 1.002-1Undetected errorLog
libcobra-java 0.98.4-3Undetected errorLog
libcommons-validator-java 1:1.3.1-7Undetected errorLog
libcoyotl 3.1.0-4.1Undetected errorLog
libdap 3.11.1-7Undetected errorLog
libdb-ruby 0.6.5-6Undetected errorLog
libdbd-odbc-perl 1.31-1Undetected errorLog
libdbd-sybase-perl 1.00-3Undetected errorLog
libdebian-installer 0.79../../../include/debian-installer/mem_chunk.h:33:93: error: 'nonnull' attribute applied to function with no pointer arguments [-Werror] Log
libdecodeqr 0.9.3-4configure: error: libcv.la not found. Log
libdevel-declare-perl 0.006006-1Undetected errorLog
libdv 1.0.0-3idct_248.c:100:3: error: cannot compile this __asm__ yet Log
libebook-tools-perl 0.4.8-1Undetected errorLog
libembperl-perl 2.3.0-2Undetected errorLog
libevocosm 3.1.0-3.1Undetected errorLog
libexml-java 0.0.20080703-2Undetected errorLog
libexplain 0.46.D001-1Undetected errorLog
libferret-ruby 0.11.6-2global.c:372:24: error: passing 'int' to parameter of incompatible type 'struct timeval' Log
libflexdock-java 0.5.2-dfsg1-2Undetected errorLog
libgdata-java 1.30.0-2Undetected errorLog
libgearman-client-async-perl 0.94-3Undetected errorLog
libgit-pure-perl 0.48-1Undetected errorLog
libgnumail-java 1.1.2-5Undetected errorLog
libgsf 1.14.21-2Undetected errorLog
libgsl-ruby 1.14.3-1Undetected errorLog
libguestfs 1.12.6-2Undetected errorLog
libhibernate-jbosscache-java 3.3.2.GA-1TreeCache.java:126: cannot find symbol Log
libhibernate-validator-java 4.0.2.GA-4Undetected errorLog
libhtml-popuptreeselect-perl 1.6-5Undetected errorLog
libimobiledevice 1.0.6-3dh_install: python-imobiledevice missing files (usr/lib/python*/*-packages/imobiledevice), aborting Log
libitpp 4.2-4Undetected errorLog
libjboss-classloader-java 2.0.6.GA-1Undetected errorLog
libjboss-deployers-java 2.0.4.GA-1Undetected errorLog
libjboss-microcontainer-java 2.0.10.GA-1Undetected errorLog
libjboss-web-services-java 0.0+svn5660+dak2-2Undetected errorLog
libjboss-xml-binding-java 2.0.3.GA-1Undetected errorLog
libjdic-java 0.9.5-7Undetected errorLog
libjgrapht0.6-java 0.6.0-10Undetected errorLog
libjgroups-java 2.7.0.GA-3Undetected errorLog
libjgroups2.6-java 2.6.15.GA-1Undetected errorLog
libjibx1.1-java 1.1.6a-2Undetected errorLog
libjibx1.2-java 1.2.3-1Undetected errorLog
libjifty-plugin-comment-perl 1.00-1Undetected errorLog
libjifty-plugin-oauth-perl 0.04-1Undetected errorLog
libjifty-plugin-wikitoolbar-perl 1.00-1Undetected errorLog
libjogl-java 1.1.1+dak1-10Undetected errorLog
libjrosetta-java 1.0.2+gpl-4Undetected errorLog
libjtds-java 1.2.5+dfsg-1Undetected errorLog
libkinosearch-perl 0.313-2Undetected errorLog
libkqueue 1.0.4-1./configure: 1: eval: disable-dependency-tracking=--disable-dependency-tracking: not found Log 729591
liblastfm-java 1:0.1.0-1Undetected errorLog
liblayout-openoffice.org 0.2.9-OOo31-3Undetected errorLog
libmime-lite-html-perl 1.23-1Undetected errorLog
libmodule-starter-plugin-cgiapp-perl 0.30-1Undetected errorLog
libmoosex-method-signatures-perl 0.36-1Undetected errorLog
libnice 0.1.0-2Undetected errorLog
liboil 0.3.17-2wavelet.c:1759:27: error: invalid use of a cast in a inline asm context requiring an l-value: remove the cast or build with -fheinous-gnu-extensions Log
libosl 0.4.0-1../lib/effect/numSimpleEffect.cc:34:16: error: cast from 'const osl::effect::EffectedNum *' to 'v2di *' (aka '__v2di *') increases required alignment from 8 to 16 [-Werror,-Wcast-align] Log
libpadre-plugin-vi-perl 0.23.0-3Undetected errorLog
libpam-krb5 4.4-1configure: error: cannot find usable Kerberos v5 library Log
libpam-ssh 1.92-14Undetected errorLog
libphash 0.9.4-1.1CImg.h:27244:18: error: declaration of 't' shadows template parameter Log
libpoex-role-sessioninstantiation-perl 1.102610-1Undetected errorLog
libprinterconf 0.5-11unsatisfiable build-dependency: tdb-dev (>= 1.0.6-4) (versioned dep on a virtual pkg?) Log
libprintsys 0.6-11.1unsatisfiable build-dependency: tdb-dev (>= 1.0.6-4) (versioned dep on a virtual pkg?) Log
libqt4pas 2.4-2Undetected errorLog
libquartz-java 1.7.3-1Undetected errorLog
libsdl1.2 1.2.14-6.4../../src/video/SDL_blit_A.c:1905:4: error: invalid operand for instruction Log
libskinlf-java 6.7-7Undetected errorLog
libspf 0.999-1.0.0-p3.dfsg-3Undetected errorLog
libspring-java 3.0.6.RELEASE-1Undetected errorLog
libspring-ldap-java 1.3.1.RELEASE-3Undetected errorLog
libspring-security-2.0-java 2.0.5.RELEASE-1Undetected errorLog
libstax-java 1.2.0-2Undetected errorLog
libtorrent 0.12.7-6poll_select.cc:126:28: error: cannot allocate function type 'rak::cacheline_allocator<> ()' with new Log
libuninameslist 0.0.20091231-1./libtool: 1: eval: base_compile+= -c: not found Log
libvigraimpex 1.7.1+dfsg1-2rf_split.hxx:156:26: error: variable has incomplete type 'vigra::CompileTimeError' Log
libvirt 0.9.4-2Undetected errorLog
libwx-perl 1:0.9901-3Undetected errorLog
libxbean-java 3.7-1Undetected errorLog
libxmpp-php 0~svn53-1.1Undetected errorLog
licq 1.5.1-1log.h:115:50: error: invalid operands to binary expression ('std::ostringstream' (aka 'basic_ostringstream') and 'const ::Custom') Log
lilo 1:23.2-2Undetected errorLog
lilypond 2.12.3-7Undetected errorLog
linpsk 1.1-1../../src/linpsk.cpp:693:48: error: taking the address of a temporary object of type 'ExtraParameter' [-Waddress-of-temporary] Log 753272
linux-2.6 3.0.0-3Undetected errorLog
liquidlnf 2.9.1-8Undetected errorLog
localizer 1.13-1Undetected errorLog
lordsawar 0.2.0-1Undetected errorLog
lsb-appchk3 3.2.2-1.1output.c:357:35: error: too many arguments in call to 'free_messages' [-Werror] Log
lsb-pkgchk3 3.2.1-1.1output.c:357:35: error: too many arguments in call to 'free_messages' [-Werror] Log
ltp 20091231+dfsg-1unsatisfiable build-dependency: libcap2-dev (>= 2.11) (versioned dep on a virtual pkg?) Log
ltrace 0.5.3-2.1ld: warning: cannot find entry symbol _start; defaulting to 0000000000400180 Log
lua-gtk 0.9+20100528-2limits.h:37:54: error: missing binary operator before token "(" Log
luabind 0.9.1+dfsg-3Undetected errorLog
lucene2 2.9.4+ds1-2Undetected errorLog
lwjgl 2.7.1+dfsg-1Undetected errorLog
m4 1.4.16-2Undetected errorLog
mah-jong 1.10-1make[1]: *** No rule to make target `/usr/lib/gtk-2.0/include/gdkconfig.h', needed by `gui.o'. Stop. Log
mail-notification 5.4.dfsg.1-2.4Undetected errorLog
mailavenger 0.8.1-4configure: error: Cannot find BerkeleyDB Log
mailfilter 0.8.2-1preferences.cc:85:51: error: expression is not assignable Log
mailsync 5.2.2-1configure: error: a working c-client installation is required for building mailsync Log
man-db 2.6.0.2-2Undetected errorLog
mapnik-viewer 0.0~svn2521-1utils.hpp:99:34: error: declaration of 'T' shadows template parameter Log
mathpiper 0.0.svn2556-2Undetected errorLog
matita 0.5.8-3Undetected errorLog
maven-antrun-plugin 1.6-1Undetected errorLog
maven-bundle-plugin 2.3.4-2Undetected errorLog
maven-clean-plugin 2.3-4Undetected errorLog
maven-compiler-plugin 2.0.2-5Undetected errorLog
maven-dependency-plugin 2.1-3Undetected errorLog
maven-enforcer 1.0~beta2-1Undetected errorLog
maven-install-plugin 2.3-3Undetected errorLog
maven-invoker-plugin 1.5-1Undetected errorLog
maven-jar-plugin 2.2-5Undetected errorLog
maven-plugin-tools 2.8-1Undetected errorLog
maven-repository-builder 1.0~alpha2-2Undetected errorLog
maven-resources-plugin 2.3-6Undetected errorLog
maven-shade-plugin 1.2.1-3Undetected errorLog
maven-site-plugin 2.1-1Undetected errorLog
maven-war-plugin 2.1~beta1-2Undetected errorLog
maxima 5.24.0-1/bin/sh: 1: ./maxima: not found Log
mcl 1:10-201-21matrix.c:1702:1: error: parameter name omitted Log
mdk 1.2.6+dfsg-1Undetected errorLog
med-fichier 2.3.6-6Undetected errorLog 751174
memcached 1.4.5-1memcached.c:1023:16: error: dereferencing type-punned pointer will break strict-aliasing rules [-Werror=strict-aliasing] Log
mensis 0.0.080507-2./libtool: 1: eval: base_compile+= -c: not found Log
mesa 7.11-5cc-Db813E.s:101:9: error: unexpected token in directive Log
mina2 2.0.4+dfsg-1Undetected errorLog
mingw32 4.2.1.dfsg-2Undetected errorLog
mingw32-binutils 2.20-0.2Undetected errorLog
mknbi 1.4.4-9Undetected errorLog
mlpcap 0.9-15Undetected errorLog
mlt 0.7.4-3./vf_yadif_template.h:236:10: error: ambiguous instructions require an explicit suffix (could be 'cmpb', 'cmpw', 'cmpl', or 'cmpq') Log
mlview 0.9.0-2.2mlview-ustring.cc:62:10: error: qualified reference to 'UString' is a constructor name rather than a type wherever a constructor can be declared Log
mm3d 1.3.7-1.2cmdmgr.cc:27:47: error: 'NULL' was not declared in this scope Log
monav 0.3-5utils.hpp:99:34: error: declaration of 'T' shadows template parameter Log
mongodb 1:1.8.3-1Undetected errorLog
morfologik-stemming 1.2.2-1Undetected errorLog
morituri 0.1.2-1Undetected errorLog
most 5.0.0a-2configure: error: unable to find the slang library and header file slang.h Log
motion 3.2.12-3ffmpeg.c:380:21: error: 'CODEC_TYPE_VIDEO' undeclared (first use in this function) Log
mpg123 1.12.1-3.2Undetected errorLog
mpich2 1.4.1-1configure: error: Cannot build shared libraries with this compiler Log
mrpt 1:0.9.5svn2563-1math_frwds.h:154:157: error: calling 'lightFromPose' with incomplete return type 'mrpt::math::TPoint2D' Log
mscore 0.9.5+dfsg-1.1Undetected errorLog
mseide-msegui 1.8-1Undetected errorLog
mssh 1.2-1mssh-terminal.c:49:5: error: 'vte_terminal_fork_command' is deprecated (declared at /usr/include/vte-0.0/vte/vtedeprecated.h:82) [-Werror=deprecated-declarations] Log
msv 2009.1+dfsg1-1data type "@@@" is already defined Log
mu-cade 0.11.dfsg1-5Undetected errorLog
multimix 19981218-12/bin/sh: 2: ps2pdf: not found Log
mumble 1.2.3-2Undetected errorLog 753273
mupdf 0.8.15-1:7:1: error: warning: ignoring directive for now Log 755741
muse 2.0~beta2-1Undetected errorLog
musescore 1.0+dfsg-2Undetected errorLog 752124
mutter 3.0.2.1-2core/window.c:7037:28: error: implicit truncation from 'int' to bitfield changes value from -5 to 3 [-Werror,-Wconstant-conversion] Log
mysql-5.1 5.1.58-1Undetected errorLog
nagios-nrpe 2.12-4configure: error: Cannot find ssl libraries Log
nagios-plugin-check-multi 0.25-1Undetected errorLog
nautic 1.3-3configure:2246: error: cannot find install-sh, install.sh, or shtool in "." "./.." "./../.." Log
ncap 1.9.2-1wrapsrv.c:346:13: error: function could be attribute 'noreturn' [-Werror,-Wmissing-noreturn] Log
ncbi-blast+ 2.2.25-5ncbifile.hpp:2673:11: error: variable type 'CMask' is an abstract class Log
nemerle 0.9.3+dfsg-3Undetected errorLog
netams 3.4.5-2./netflow.h:242:27: error: 'long type-name' is invalid Log
netatalk 2.2~beta4-1Undetected errorLog
netkit-bootparamd 0.17-9Undetected errorLog
netkit-rusers 0.17-8Undetected errorLog
netkit-rwall 0.17-7Undetected errorLog
netrek-client-cow 3.3.0-3Undetected errorLog
nfs-utils 1:1.2.4-1configure: error: Kerberos v5 with GSS support not found: consider --disable-gss or --with-krb5= Log
nget 0.27.1-11./par2/par2fileformat.h:89:25: error: flexible array member 'entries' of non-POD element type 'FILEVERIFICATIONENTRY []' Log
nipype 0.4.1-1ImportError: No module named design_matrix Log
nlpsolver 0.9~beta1-6Undetected errorLog
nodejs 0.4.11-1Undetected errorLog
notify-osd 0.9.30-1test-withlib.c:97:14: error: too many arguments to function call, expected 3, have 4 Log
nova 2011.2-1Undetected errorLog
nunit 2.4.7+dfsg-6Undetected errorLog
nut 2.6.1-2Undetected errorLog
nwchem 6.0-1Undetected errorLog
ocaml-sqlite3 1.6.1-1Undetected errorLog
ocamlnet 3.4-1Undetected errorLog
omegat 2.3.0.1+dfsg-1Undetected errorLog
omegat-plugin-tokenizer 0.4.2+dfsg-1Undetected errorLog
opal 3.6.8~dfsg-2opalmixer.h:102:27: error: member function 'GetPointer' not viable: 'this' argument has type 'const PBYTEArray', but function is not marked const Log
openafs 1.6.0-1Undetected errorLog
openbios-ppc 1.0+svn1018-1Undetected errorLog
openbios-sparc 1.0+svn1018-1Undetected errorLog
openldap 2.4.25-3Undetected errorLog
openmsx-catapult 0.8.1-2Undetected errorLog
openssh 1:5.9p1-1Undetected errorLog
opensync 0.39-4dh_install: python-opensync missing files (usr/lib/python*/site-packages/opensync.py), aborting Log
openvpn-auth-ldap 2.0.3-1.1configure: error: Can't locate Objective C runtime headers Log
osmosis 0.34+ds1-1Undetected errorLog
otcl 1.14~RC3+dfsg1-2tclInt.h:54:13: error: typedef redefinition with different types ('int' vs 'typeof (((int *)0) - ((int *)0))' (aka 'long')) Log
p11-kit 0.4-2Undetected errorLog
padre 0.90.ds1-1Undetected errorLog
paraview 3.10.1-5pqServerManagerSelectionModel.h:71:22: error: expression is not an integer constant expression Log
parcimonie 0.5.2-1Undetected errorLog
parsec47 0.2.dfsg1-3Undetected errorLog
pdfedit 0.4.5-2Object.h:209:3: error: anonymous union at class scope must not have a storage specifier Log
pdftk 1.44-3PdfStream.java:242: error: PdfEncryption cannot be resolved to a type Log
pearpc 0.4.0-5./ppc_mmu.h:70:15: error: function declared with with regparm(3) attribute was previously declared without the regparm attribute Log
pentaho-reporting-flow-engine-openoffice.org 0.9.2-OOo31-3Undetected errorLog
perl 5.12.4-4Undetected errorLog
pgsql-asn1oid 0.0.20100818-1make[1]: *** No rule to make target `/usr/lib/postgresql/9.1/lib/pgxs/src/makefiles/pgxs.mk'. Stop. Log
pgtap 0.25.0-1make[1]: *** No rule to make target `/usr/lib/postgresql/9.1/lib/pgxs/src/makefiles/pgxs.mk'. Stop. Log
phonefsod 0.1+git20100802-2Undetected errorLog
phoneuid 0.1+git20100502-1make[3]: *** No rule to make target `/usr/share/shr-specs//org.shr.phoneui.Contacts.xml', needed by `phoneuid-contacts-service-glue.h'. Stop. Log
php-gettext 1.0.10-1Undetected errorLog
php-sasl 0.1.0-1configure: error: Failed to locate a compatible SASL library in /usr/lib Log
php5 5.3.8-1configure: error: Cannot find OpenSSL's libraries Log
pidgin-sipe 1.11.2-1sipe-incoming.c:258:11: error: variable 'is_triggered' set but not used [-Werror=unused-but-set-variable] Log
pingus 0.7.3-1src/lisp/getters.hpp:33:15: error: no viable conversion from 'boost::shared_ptr' to 'const lisp::Lisp *' Log
pivy 0.5.0~svn765-2pivy/coin_wrap.cpp:35402:76: error: non-const lvalue reference to type 'SoDBHeaderCB *' (aka 'void (*)(void *, SoInput *)') cannot bind to a value of unrelated type 'SoDBHeaderCB **' (aka 'void (**)(void *, SoInput *)') Log
plplot 5.9.5-4clang: error: unable to execute command: Broken pipe Log
polybori 0.5~rc1-2.1polybori/include/CDDManager.h:281:28: error: 'mutable' cannot be applied to references Log
postgresql-pljava 1.4.2-4dpkg-buildpackage: error: dpkg-genchanges gave error exit status 2 Log
postler 0.1.1-1wscript:137: error: the configuration failed (see '/build/postler-1xAM6t/postler-0.1.1/_build_/config.log') Log
pouetchess 0.2.0-4Undetected errorLog
projectl 1.001.dfsg1-3Undetected errorLog
psi-plus 0.15~svn3910-1Undetected errorLog
pspp 0.6.2-3lib/gtksheet/gtkitementry.c:148:21: error: static declaration of 'gtk_entry_reset_im_context' follows non-static declaration Log
pulseaudio 0.9.23-1Undetected errorLog
putty 0.61-1../timing.c:54:15: error: ordered comparison of function pointers ('timer_fn_t' (aka 'void (*)(void *, long)') and 'timer_fn_t') [-Werror] Log
pygame 1.8.1release-2SCRAP : not found Log 812717
pylucene 2.3.1-1.1Undetected errorLog
pymvpa 0.4.7-2unsatisfiable build-dependency: python-docutils (< 0.6) but 0.7-4 is to be installed Log
python-apt 0.8.0Undetected errorLog
python-bottle 0.9.5-1Undetected errorLog
python-enable 4.0.0-2Undetected errorLog
python-evas 0.5.0+r49677-1Undetected errorLog
python-eventlet 0.9.16-1Undetected errorLog
python-glpk 0.4.43-2unsatisfiable build-dependency: libglpk-dev (< 4.44) but 4.45-1 is to be installed Log
python-pypcap 1.1.2+debian-2Undetected errorLog
python-stdnum 0.5-2Undetected errorLog
python2.6 2.6.7-4Undetected errorLog
python2.7 2.7.2-5Undetected errorLog
python3.2 3.2.2~rc1-1Undetected errorLog
pythonmagick 0.9.1-3_Image.cpp:89:108: error: address of overloaded function 'channelDepth' does not match required type 'void (MagickCore::ChannelType, unsigned int)' Log
pyxine 0.1alpha2-7pyxine/libxine_wrap.c:3141:2: error: invalid preprocessing directive Log
pyxnat 0.9.0~dev0-1Undetected errorLog
pyxpcom 1:2.0~hg20110502-3make[6]: *** No rule to make target `/usr/lib/xulrunner-devel-6.0/bin/xpt_link', needed by `_xpidlgen/pyxpcom_test.xpt'. Stop. Log
qca-tls 1.0-4qca-tls.cpp:1010:10: error: assigning to 'SSL_METHOD *' (aka 'ssl_method_st *') from incompatible type 'const SSL_METHOD *' (aka 'const ssl_method_st *') Log
qemu 0.14.1+dfsg-3cc-uQT2aq.s:11:16: error: unexpected token in '.macro' directive Log
qt-gstreamer 0.10.1-2Undetected errorLog
quiteinsanegimpplugin 0.3-9Undetected errorLog
qutecsound 0.6.1-1Undetected errorLog
qxmlrpc 0.0.svn6-2Undetected errorLog
r-cran-xml 3.4-2-1Undetected errorLog
rampart 1.3.0-1error.c:91:5: error: implicitly declaring C library function 'vsnprintf' with type 'int (char *, unsigned long, const char *, __va_list_tag *)' [-Werror] Log
rdup 1.0.5-1rdup-tr.c:45:30: error: variable 'p' set but not used [-Werror=unused-but-set-variable] Log
recutils 1.3-11Undetected errorLog
red5 1.0~svn4198-2Undetected errorLog
refpolicy 2:0.2.20100524-12Undetected errorLog
renameutils 0.11.0-1Undetected errorLog
rheolef 5.93-2iorheo.cc:186:16: error: explicit instantiation of 'rheolef::iorheobase_memory_handler' must occur in namespace 'rheolef' [-Werror,-Wc++0x-compat] Log
rjava 0.9-1-1configure: error: Cannot compile a simple JNI program. See config.log for details. Log
rrep 1.3.3-2Undetected errorLog
rstatd 4.0.1-4Undetected errorLog
ruby-bio 1.4.1-2Undetected errorLog
ruby-ferret 0.11.6-3global.c:372:24: error: passing 'int' to parameter of incompatible type 'struct timeval' Log
ruby-gruff 0.3.6-4Undetected errorLog
ruby-ogginfo 0.6.5-1sh: 1: oggenc: not found Log
ruby-yajl 0.8.3-2Undetected errorLog
ruby1.8 1.8.7.352-2Undetected errorLog
rush 1.7+dfsg-1Undetected errorLog
rutilt 0.16-2include/WE17Driver.h:107:9: error: 'mutable' cannot be applied to references Log
saga 2.0.7+dfsg-1table.cpp:128:17: error: taking the address of a temporary object of type 'CSG_Table' [-Waddress-of-temporary] Log
samhain 2.6.2-2Undetected errorLog
sat4j 2.3.0-2/bin/sh: 1: /usr/lib/jvm/java-6-openjdk/bin/java: not found Log
sbcl 2:1.0.51.0-1Undetected errorLog
sbnc 1.2-24./../src/Object.h:163:14: error: 'CUser' is an incomplete type Log
scenic 0.6.3-1configure: error: Could not link against ! Log
scim-chewing 0.3.3-2configure: error: Package requirements (chewing = 0.3.2) were not met: Log
scim-python 0.1.13~rc1-3../../src/scim-python-lookup-table.cpp:599:22: error: destructor type 'scim::LookupTable' in object destruction expression does not match the type 'PyLookupTable' of the object being destroyed Log
scorched3d 43.2a.dfsg-5Undetected errorLog
scrollz 2.1-1make[2]: *** No rule to make target `/usr/include/sys/stat.h', needed by `alias.o'. Stop. Log 760678
sd 0.74-1Undetected errorLog
sed 4.2.1-9Undetected errorLog
segment 1.3.5~svn57+dfsg-1Undetected errorLog
serna-free 4.3.0.20110221-5debug.h:49:13: error: inline namespace cannot be reopened as non-inline Log
setools 3.3.6.ds-7.2configure: error: this version of libsepol is incompatible with SETools Log
sexplib310 5.2.1-1Undetected errorLog
shiboken 1.0.6-1Undetected errorLog
shogun 0.10.0-2.1../shogun/lib/SimpleFile.h:66:31: error: non-const lvalue reference to type 'int64_t' (aka 'long') cannot bind to a temporary of type 'int' Log
simplyhtml 0.13.1-2Undetected errorLog
simulavr 0.1.2.2-6.1disp.c:246:34: error: variable 'areg' set but not used [-Werror=unused-but-set-variable] Log 754591
slang-slirp 1.9.8-1.1configure: error: unable to find the slang library and header file slang.h Log
slcfitsio 0.3.8+nosvn-4configure: error: unable to find the slang library and header file slang.h Log
slcurl 0.2.1-4.1configure: error: unable to find the slang library and header file slang.h Log
slgsl 0.7.0-5configure: error: unable to find the slang library and header file slang.h Log
slhist 0.3.2a-3configure: error: unable to find the slang library and header file slang.h Log
slicer 3.6.3~svn16592-1Undetected errorLog
slpvm 0.1.5-12configure: error: unable to find the slang library and header file slang.h Log
slxfig 0.2.0~.35-1configure: error: unable to find the slang library and header file slang.h Log
snacc 1.3bbn-10Undetected errorLog
solr 1.4.1+dfsg1-2Undetected errorLog
soundmodem 0.16-1../matlib/mat.hh:450:4: error: assigning to 'unsigned int *' from incompatible type 'void *' Log
sphinxsearch 0.9.9-9make[2]: *** No rule to make target `src_c/stem_ISO_8859_1_danish.c', needed by `stem_ISO_8859_1_danish.o'. Stop. Log
spim 8.0+dfsg-5../CPU/spim-utils.c:117:20: error: operand of type 'void' where arithmetic or pointer type is required Log
squeak-vm 1:4.4.7.2357-1Undetected errorLog 740972
ssed 3.62-6.5Undetected errorLog
ssldump 0.9b3-4configure: error: Couldn't find PCAP library: needed for ssldump Log
ssreflect 1.3pl1-4Undetected errorLog
stalin 0.11-5Undetected errorLog
stardict 3.0.1-7scene.hpp:21:16: error: 'NULL' was not declared in this scope Log
stgit 0.15-1Undetected errorLog
stimfit 0.10.13-1configure: error: google-test is required. Try --with-gtest-config. Log
styx 1.8.0-1sysbase1.c:524:50: error: invalid token at start of a preprocessor expression Log
subtitlecomposer 0.5.3-3scripting_subtitle.cpp:68:13: error: calling a private constructor of class 'SubtitleComposer::Scripting::SubtitleLine' Log
sugar-hulahop 0.8.1-1mozalloc.h:227:7: error: exception specification in declaration does not match previous declaration Log
surefire 2.4.3-4Undetected errorLog
tar 1.26-2Undetected errorLog
tatan 1.0.dfsg1-2Undetected errorLog
tclodbc 2.5.1-1configure: error: Cannot find an ODBC library path Log
tcpreplay 3.4.3-2configure: error: Unable to find matching library for header file in /usr Log
tdb 1.2.9-3Undetected errorLog
telepathy-salut 0.5.0-3wocky-connector-test.c:3431:11: error: using the result of an assignment as a condition without parentheses [-Werror,-Wparentheses] Log
testng 5.11+dfsg-2make: /usr/lib/jvm/java-6-openjdk/bin/java: Command not found Log
tevent 0.9.14-1Undetected errorLog
thunar 1.2.2-1Undetected errorLog
tiemu 3.02-1.1gui/calc/calc.c:589:4: error: 'GtkFunction' undeclared (first use in this function) Log
tijmp 0.8+dfsg-5configure: error: Does JAVA_HOME point to the java SDK directory? Log
tinylaf 1.4.0-2Undetected errorLog
tinyproxy 1.8.2-2Undetected errorLog
tipcutils 1.0.4-7unsatisfiable build-dependency: linux-libc-dev (< 2.6.34) but 3.0.0-3 is to be installed Log
titanion 0.3.dfsg1-3Undetected errorLog
tkgate 1.8.7-2Undetected errorLog
tkrat 1:2.2cvs20100105-true-dfsg-5Undetected errorLog
tomcat-maven-plugin 1.1-1Undetected errorLog
tomoe 0.6.0-1.1Undetected errorLog
tor 0.2.2.32-1Undetected errorLog
torus-trooper 0.22.dfsg1-6Undetected errorLog
traverso 0.49.2-4Tsar.h:66:9: error: field has incomplete type 'void *[]' Log
tudu 0.8.1-1Undetected errorLog
tumbler 0.1.21-3Undetected errorLog
tumiki-fighters 0.2.dfsg1-4Undetected errorLog
u-boot 2011.06-4make[1]: *** No rule to make target `include/autoconf.mk', needed by `depend'. Stop. Log
uimaj 2.3.1-1Undetected errorLog
uisp 20050207-4Stk500.C:727:9: error: variable 'addr' set but not used [-Werror=unused-but-set-variable] Log
umlet 10.4-1/bin/sh: 1: /usr/lib/jvm/java-6-openjdk/bin/javac: not found Log
upx-ucl 3.07-3main.cpp:1288:5: error: '__acc_cta_t' declared as an array with a negative size Log
ust 0.15-3ld: final link failed: Bad value Log
val-and-rick 0.1a.dfsg1-2Undetected errorLog
valgrind 1:3.6.1-6configure: error: please use a recent (>= gcc-3.0) version of gcc Log
vidalia 0.2.14-2TorSettings.h:80:38: error: invalid storage class specifier in function declarator Log
vim 2:7.3.280-1Undetected errorLog
vlc 1.1.11-2./control/nporuntime.h:222:13: error: static declaration of 'RuntimeNPClassGetProperty' follows non-static declaration Log
wdiff 0.6.5-1Undetected errorLog
webhelpers 1.3-2Undetected errorLog
webkit 1.2.7-3Undetected errorLog
webkitgtk+ 1.4.2-2Intrinsic.h:66:15: error: typedef redefinition with different types ('char *' vs 'WTF::String') Log
weka 3.6.5-1Undetected errorLog
wesnoth-1.8 1:1.8.6-1configure: error: *** G++ major version 2.9 is too old. Log
wesnoth-1.9 1:1.9.9-1Undetected errorLog
win32-loader 0.7.4.1win32-loader.c:41:3: error: illegal storage class on function Log
wine 1.0.1-3.3{standard input}:38: Error: operand type mismatch for `push' Log
wireless-regdb 2011.04.28-1Undetected errorLog
wmaker 0.92.0-8.2Undetected errorLog
wmbubble 1.46-2.1clang: error: language not recognized: '11-2.0' Log
wss4j 1.5.8+svntag-1 [javac] WSSecSignature.java:105: cannot find symbol Log
wvdial 1.61-4uniconfgen.h:323:19: error: no class named 'Iter' in 'UniConfGen' Log
xapian-core 1.2.7-1Undetected errorLog
xdb 1.2.0-7.2dh_install: libxdb1 missing files (debian/tmp/usr/lib/*.so.*), aborting Log
xdotool 1:2.20110530.1-3Undetected errorLog
xenomai 2.5.6-3../../../src/include/asm/xenomai/arith_64.h:74:2: error: cannot compile this __asm__ yet Log
xfonts-mona 2.90-6Undetected errorLog
xfprint4 4.6.1-2Undetected errorLog
xmlgraphics-commons 1.4.dfsg-3Undetected errorLog
xmms2 0.7DrNo+dfsg-3Checking for sc68 >= 2.3.0 : /bin/sh: 1: sc68-config: not found Log
xmpi 2.2.3b8-11configure: error: cannot continue -- cannot find Trillium header files Log
xnbd 0.1.0-pre+hg20110702-1make[1]: *** No rule to make target `distclean'. Stop. Log
xorg-docs 1:1.6-1Undetected errorLog
xorp 1.6-3selector.cc:234:10: error: variable 'resize' set but not used [-Werror=unused-but-set-variable] Log
xscreensaver 5.14-1configure: error: Couldn't find X11 headers/libs. Try `./configure --help'. Log
xymon 4.3.0~beta2.dfsg-9test-rrd.c:30:61: error: too few arguments to function call, expected 8, have 5 Log
zapping 0.10~cvs6-5../../libtv/misc.h:52:5: error: invalid token at start of a preprocessor expression Log
zemberek 2.1.1-8Undetected errorLog
zemberek-ooo 1.0~rc2-10.2Undetected errorLog
zemberek-server 0.7.1-12Undetected errorLog
zeroc-ice 3.4.2-4../../include/Ice/Stream.h:545:19: error: In file included from CommunicatorI.cpp:11: Log
zile 2.3.21-1Undetected errorLog
zipios++ 0.1.5.9+cvs.2007.04.28-5directory.h:85:12: error: 'ptrdiff_t' does not name a type Log
zvbi 0.2.33-4./misc.h:56:5: error: invalid token at start of a preprocessor expression Log
zziplib 0.13.56-1x86_64-linux-gnu-gcc: error: unrecognized option '--export-dynamic' Log
660 errors
Return to the list