Debian Package rebuild

Rebuild of the Debian archive with clang

"Not categorized" build failure(s)
clang 3.4.2
Return to the list

Versions: 2.9 - 3.0 - 3.1 - 3.2 - 3.3 - 3.4 - 3.4.2 - 3.5.0 - 3.6.0 - 3.8.1 - 3.9.1 - 4.0.1 - 5.0
PackageVersionSupposed error messageFull log Bug report
9base 1:6-6n1.c:124:5: error: unterminated function-like macro invocation Log
aconnectgui 0.9.0rc2-1-9configure: error: Sufficiently new version of libasound not found. Log 684508
acpid 1:2.0.22-1configure: error: "asprintf() not found" Log
activiz.net 1:1.0~git20111214-2stddef.h:29:42: error: missing binary operator before token "(" Log
aegis 4.24.3-3Undetected errorLog
aeskulap 0.2.2b1-13./poolinstance.h:53:25: error: no function named 'remove_instance' with type 'void (const Glib::RefPtr &)' was found in the specified scope Log
agave 0.4.7-2.1refptr.h:208:16: error: member access into incomplete type 'gcs::PaletteTreeModel' Log
analitza 4:4.13.1-2Undetected errorLog
apbs 1.4-1Undetected errorLog
aplus-fsf 4.22.1-6../MSTypes/MSFloatMatrix.H:30:1: error: template specialization requires 'template<>' Log
apt 1.0.4Undetected errorLog
aptitude 0.6.11-1configure: error: in `/«PKGBUILDDIR»/build-arch' Log
aqemu 0.8.2-2VM.cpp:4566:75: error: reference to type 'const QString' could not bind to an rvalue of type 'bool' Log
arj 3.10.22-11Undetected errorLog
aspectc++ 1:1.2-1stddef.h:29: error: unexpected token `(' in conditional Log
atlas 3.10.1-4Undetected errorLog
atlas-cpp 0.6.2-4Undetected errorLog
attica 0.4.2-1Undetected errorLog
avifile 1:0.7.48~20090503.ds-15common/avm_output.cpp:20:12: error: qualified reference to 'AvmOutput' is a constructor name rather than a type wherever a constructor can be declared Log
avw.lv2 0.1.6~dfsg0-1ui_features.hpp:47:45: error: assigning to 'mapped_type' (aka 'void (*)(void *, void *)') from incompatible type 'void (*)(void *, FeatureData *)': type mismatch at 2nd parameter ('void *' vs 'FeatureData *' (aka 'void **')) Log
ax25-tools 0.0.10-rc2+cvs20120204-3./rip98d.h:47:12: error: restrict requires a pointer or reference Log
blackbox 0.70.1-23Undetected errorLog
blas 1.2.20110419-7Undetected errorLog
blktap 2.0.90-2libvhd.c:1073:2: error: indirection of non-volatile null pointer will be deleted, not trap [-Werror,-Wnull-dereference] Log
boinc 7.3.19+dfsg-3configure: error: in `/«BUILDDIR»/boinc-7.3.19+dfsg' Log
bomberclone 0.11.9-4../include/gfx.h:108:20: error: inline function 'gfx_blitupdaterectclear' is not defined [-Werror,-Wundefined-inline] Log
canl-c++ 1.1.0-1make[2]: *** No rule to make target '', needed by 'canl_wrap.cpp'. Stop. Log
cegui-mk2 0.7.6-3.2../../cegui/include/CEGUIWindowFactoryManager.h:486:9: error: cannot catch reference to incomplete type 'CEGUI::Exception' Log
cgal 4.4-1Undetected errorLog
cigi-ccl 3.3.3a+svn818-7dh_install: libcigicl-dev missing files (usr/lib/*/pkgconfig/*), aborting Log
clsync 0.3-1configure: error: "Unable to find libdl" Log
clutter-1.0 1.18.2-2Undetected errorLog
cmake 2.8.12.1-1.4main.s:22:2: error: input can't have .file dwarf directives when -g is used to generate dwarf debug info for assembly code Log
cmocka 0.4.1-2dh_auto_test: make -j1 test ARGS+=-j1 returned exit code 2 Log
coinor-flopc++ 1.0.6-3.1./MP_domain.hpp:180:18: error: return type of virtual function 'getSet' is not covariant with the return type of the function it overrides ('flopc::MP_set_base' is incomplete) Log
comedilib 0.10.1-1.1clang: error: clang frontend command failed with exit code 70 (use -v to see invocation) Log
cone 0.89-1cursesmessage.C:3764:18: error: cannot create a non-constant pointer to member function Log
cook 2.33-1Undetected errorLog
csound 1:6.03.2~dfsg-1Undetected errorLog
cssc 1.3.0-4dh_auto_test: make -j10 check returned exit code 2 Log
ctpp2 2.8.3-10Undetected errorLog
cutter-testing-framework 1.2.4-1dh_auto_test: make -j1 check returned exit code 2 Log
dacs 1.4.28b-3Undetected errorLog
dicom3tools 1.00~20140527121828-1./Imakefile:171:3: error: invalid preprocessing directive Log
din 5.2.1-2main.cc:296:49: error: non-aggregate type 'const color' cannot be initialized with an initializer list Log
diskscan 0.14.1-4lib/diskscan.c:62:9: error: will never be executed [-Werror,-Wunreachable-code] Log
dmapi 2.2.10-1Undetected errorLog
ekg2 1:0.4~pre+20120506.1-4Makefile.am:144: error: 'plugins/autoresponder/autoresponder.la' is not a standard libtool library name Log
elektra 0.7.1-1Undetected errorLog
elmerfem 6.1.0.svn.5396.dfsg2-4DEPS Log
estic 1.61-20.1./coll.h:317:7: error: invalid operands to binary expression ('Stream' and 'u32' (aka 'unsigned int')) Log
esys-particle 2.3-2./SphAggGougeBlock.hpp:39:37: error: no viable conversion from '__normal_iterator' to '__normal_iterator' Log
evolution-data-server 3.12.2-1Undetected errorLog
fcitx 1:4.2.8.4-2Undetected errorLog
fftw3 3.3.4-1openmp.c:26:2: error: OpenMP enabled but not using an OpenMP compiler Log
freefem3d 1.0pre10-3.2libtool.m4: error: problem compiling CXX test program Log
freefoam 0.1.0+dfsg-1.1Pstream.H:518:29: error: no function named 'reduce' with type 'void (scalar &, const sumOp &)' was found in the specified scope Log
freetype 2.5.2-1./builds/unix/ftconfig.h:532:5: error: 'long long' is an extension when C99 mode is not enabled [-Werror,-Wlong-long] Log
fslview 4.0.1-4DEPS Log
fsvs 1.2.5-1configure: error: in `/«PKGBUILDDIR»' Log
fvwm 1:2.6.5.ds-3configure: error: " Log
game-music-emu 0.5.5-2Undetected errorLog
gbsplay 0.0.91-1Undetected errorLog
gdal 1.10.1+dfsg-5gdal_wrap.cpp:4494:12: error: assigning to 'char *' from incompatible type 'const char *' Log
gdb-arm-none-eabi 2Dependencies installation failed Log
gdcm 2.4.2-1stddef.h:29:42: error: missing binary operator before token "(" Log
genius 1.0.17-1configure: error: Termcap library not found Log
ghc 7.6.3-13configure: error: Building ghc-pwd failed Log
giftrans 1.12.2-18Undetected errorLog
glibmm2.4 2.40.0-1Undetected errorLog
gmerlin 1.2.0~dfsg+1-1bgyadif.c:769:9: error: ambiguous instructions require an explicit suffix (could be 'cmpb', 'cmpw', 'cmpl', or 'cmpq') Log
gnash 0.8.11~git20140419-1agg_scanline_u.h:476:30: error: type 'base_type' (aka 'agg::scanline_u8') is not a direct or virtual base of 'scanline32_u8_am' Log
gnat-4.9 4.9.0-2configure: error: GNAT is required to build ada Log
gnat-mingw-w64 13configure: error: GNAT is required to build ada Log
gnucap 1:0.36~20091207-2./mg_.h:134:19: error: variable has incomplete type 'C_Comment' Log
gnustep-gui 0.20.0-3GSSpeechSynthesizer.m:118:21: error: direct access to Objective-C's isa is deprecated in favor of object_getClass() [-Werror,-Wdeprecated-objc-isa-usage] Log
golang 2:1.2.1-2Undetected errorLog
google-glog 0.3.3-2Undetected errorLog
google-perftools 2.1-2Undetected errorLog
gprolog 1.3.0-6.1Undetected errorLog
grantlee 0.3.0-5Undetected errorLog
gringo 4.3.0-2Undetected errorLog
grub 0.97-67configure: error: x86_64-linux-gnu-gcc cannot compile C source code Log
gtk+3.0 3.12.2-1Undetected errorLog
guymager 0.7.3-2aewf.cpp:141:12: error: field has incomplete type 'uint []' Log
hardening-wrapper 2.5dh_auto_test: make -j1 check returned exit code 2 Log
hivex 1.3.10-1../../../ocaml/hivex_c.c:52:1: error: static declaration of 'caml_raise_with_args' follows non-static declaration Log
htmlcxx 0.85-3Undetected errorLog
hugs98 98.200609.21-5.3tools/make_bootlib: 68: tools/make_bootlib: -D__HUGS__: not found Log
hylafax 3:6.0.6-5Undetected errorLog
hyperestraier 1.4.13-12/usr/lib/ruby/2.1.0/mkmf.rb:456:in `try_do': The compiler failed to generate an executable file. (RuntimeError) Log
icecc 1.0.1-1dh_install: missing files, aborting Log
icewm 1.3.7-5../../src/apppstatus.cc:85:5: error: cannot delete expression of type 'YColor *[3]' Log
idjc 0.8.14-1configure: error: "math library is missing critical function" Log
imvirt 0.9.6-1vmware.c:65:5: error: invalid operand for instruction Log
kannel 1.4.3-2test/test_octstr_format.c:66:28: error: integer constant is larger than the largest unsigned integer type Log
kde-baseapps 4:4.12.4-1Undetected errorLog
kde-workspace 4:4.11.9-1Undetected errorLog
kde4libs 4:4.13.1-1Undetected errorLog
kdegraphics-mobipocket 4:4.12.2-2Undetected errorLog
kiten 4:4.13.1-1Undetected errorLog
kopete 4:4.13.1-1Undetected errorLog
kplayer 1:0.7-2.1kplayernode.cpp:2401:5: error: unexpected ':' in nested name specifier; did you mean '::'? Log
ktp-common-internals 0.8.1-2Undetected errorLog
laserboy 2012.11.11-1LaserBoy_frame_set.hpp:259:38: error: parameter of overloaded 'operator++' cannot have a default argument Log
lcgdm 1.8.7-3Undetected errorLog
lensfun 0.2.8-1lensfun.h:68:13: error: "I don't know how to change symbol visibility for your compiler" Log
libaqbanking 5.4.3beta-2Undetected errorLog
libb-hooks-parser-perl 0.12-1dh_auto_test: make -j1 test returned exit code 2 Log
libcrypto++ 5.6.1-6gcm.cpp:746:3: error: unknown token in expression Log
libdbi-drivers 0.9.0-3Undetected errorLog
libdbusmenu-qt 0.9.2-1Undetected errorLog
libgcrypt20 1.6.1-2dh_auto_test: make -j10 check returned exit code 2 Log
libgisi 0.1.0-1gisicomm.c:1848:8: error: duplicate case value: 'MTC_STATE_NONE' and 'MTC_CMT_ONLY_MODE' both equal '255' Log
libgphoto2 2.5.4-1Undetected errorLog
libkcddb 4:4.13.1-1Undetected errorLog
libkdegames 4:4.13.1-1Undetected errorLog
libkdtree++ 0.7.1+git20101123-3kdtree.hpp:1207:28: error: invalid operands to binary expression ('basic_ostream >' and 'const KDTree::_Node_base') Log
libktorrent 1.3.1-3Undetected errorLog
liblastfm 1.0.8-2Undetected errorLog
liblognorm 0.3.7-1Undetected errorLog
libmm-qt 1.0.1-2Undetected errorLog
libnm-qt 0.9.8.1-3Undetected errorLog
liboil 0.3.17-2wavelet.c:1759:27: error: invalid use of a cast in a inline asm context requiring an l-value: remove the cast or build with -fheinous-gnu-extensions Log
libomxalsa 0.1-2configure: error: POSIX threads support is required Log
libomxcamera 0.1-2configure: error: in `/«PKGBUILDDIR»' Log
libomxfbdevsink 0.1-2configure: error: in `/«PKGBUILDDIR»' Log
libomxil-bellagio 0.9.3-2configure: error: libdl is required Log
libomxmad 0.1-1configure: error: POSIX threads support is required Log
libomxvideosrc 0.1-1configure: error: in `/«PKGBUILDDIR»' Log
libomxvorbis 0.1-3configure: error: in `/«PKGBUILDDIR»' Log
libomxxvideo 0.1-2configure: error: POSIX threads support is required Log
libopendbx 1.4.6-6Undetected errorLog
libpdl-stats-perl 0.6.5-1dh_auto_test: make -j1 test returned exit code 2 Log
libqt4pas 2.5-10Undetected errorLog
libs3 2.0-2inc/request.h:131:14: error: sizeof on pointer operation will return size of 'char *' instead of 'char [9]' [-Werror,-Wsizeof-array-decay] Log
libtemplates-parser 11.8.2014-1Undetected errorLog
libv8-3.14 3.14.5.8-8../src/../include/v8.h:2990:5: error: anonymous types declared in an anonymous union are an extension [-Werror,-Wnested-anon-types] Log
libwx-perl 1:0.9923-1Undetected errorLog
libwx-scintilla-perl 0.39-1Undetected errorLog
libzen 0.4.29-1Undetected errorLog
lierolibre 0.5-1src/gvl/io/encoding.hpp:586:19: error: cast from pointer to smaller type 'uint32_t' (aka 'unsigned int') loses information Log
lightspark 0.7.2-3.1Undetected errorLog
linux 3.14.7-1RuntimeError: Can't upload to unstable with a version of 3.14.7-1clang1 Log
linux-latest 57Undetected errorLog
linux-tools 3.14-1Undetected errorLog
lookup 1.08b-11lib/romaji2kana.c:59:12: error: source file is not valid UTF-8 Log
lordsawar 0.2.0-2.1armyproto.cpp:39:34: error: array initializer must be an initializer list Log
lvtk 1.1.1~dfsg0-1ui_features.hpp:47:45: error: assigning to 'mapped_type' (aka 'void (*)(void *, void *)') from incompatible type 'void (*)(void *, FeatureData *)': type mismatch at 2nd parameter ('void *' vs 'FeatureData *' (aka 'void **')) Log
lwt 2.4.3-4Undetected errorLog
m4 1.4.17-4dh_auto_test: make -j1 check returned exit code 2 Log
marble 4:4.13.1-2Undetected errorLog
meep 1.2.1-1dh_auto_test: make -j1 check returned exit code 2 Log
megaglest 3.7.1-3.1Undetected errorLog
memcached 1.4.13-0.3testapp.c:1784:13: error: variable length array folded to constant array as an extension [-Werror,-Wgnu-folding-constant] Log
memtest86 4.3.6-1main.c:229:2: error: indirect goto in function with no address-of-label expressions Log
memtest86+ 4.20-1.1main.c:118:2: error: indirect goto in function with no address-of-label expressions Log
mesa 10.1.4-1../../../../../../src/gallium/state_trackers/clover/util/adaptor.hpp:47:16: error: function cannot return function type 'clover::device &(_cl_device_id *)' Log
minc 2.2.00-4dh_auto_test: make -j1 check returned exit code 2 Log 741744
mira 4.0.2-1clang: error: argument to '-V' is missing (expected 1 value) Log
mknbi 1.4.4-10Undetected errorLog
mldemos 0.5.1-3./SECovarianceFunction.h:23:13: error: field has incomplete type 'float []' Log
mosquitto 1.2.1-109-util-topic-tokenise.c:8:21: error: data argument not used by format string [-Werror,-Wformat-extra-args] Log
mozjs17 17.0.0-1jsinterp.cpp:3684:9: error: indirect goto might cross protected scopes Log
mpich2 1.4.1-4.2configure: error: Cannot build shared libraries with this compiler Log
mrpt 1:1.0.2-1math_frwds.h:161:157: error: calling 'lightFromPose' with incomplete return type 'mrpt::math::TPoint2D' Log
mrs 6.0.4+dfsg-1Undetected errorLog
mwrap 0.33-1dh_auto_test: make -j1 test returned exit code 2 Log
nast 0.2.0-6Undetected errorLog
nn 6.7.3-8make[2]: *** No rule to make target ' articles.h', needed by 'nn.o'. Stop. Log
npapi-vlc 2.0.6-2./control/nporuntime.h:225:13: error: static declaration of 'RuntimeNPClassGetProperty' follows non-static declaration Log
ns2 2.35+dfsg-1.1common/tclAppInit.cc:240:26: error: declaration of 'globalMemTrace' has a different language linkage Log
nss 2:3.16.1-1intel-gcm.s:29:13: error: unknown token in expression Log
ntdb 1.0-4Undetected errorLog
ntl 5.5.2-2Undetected errorLog
ntrack 016-1.2Undetected errorLog
oasis 0.4.4-2Undetected errorLog
obby 0.4.8-1../inc/zeroconf_avahi.hpp:135:40: error: assigning to 'AvahiWatchEvent' from incompatible type 'int' Log
obexftp 0.23-2bfb_io.c:415:44: error: hex escape sequence out of range Log
ocaml-text 0.6-3Undetected errorLog
ocl-icd 2.1.3-4run_dummy_icd.c:29:34: error: unknown warning group '-Wcpp', ignored [-Werror,-Wunknown-pragmas] Log
octave-io 2.2.2-1Undetected errorLog
okteta 4:4.13.1-1Undetected errorLog
okular 4:4.13.1-2Undetected errorLog
open-cobol 1.1-1dh_auto_test: make -j1 check returned exit code 2 Log
openclonk 5.4.1-1Undetected errorLog
openhpi 2.14.1-1.4ipmi.cpp:1563:83: error: alias must point to a defined variable or function Log
openjdk-6 6b31-1.13.3-1callNative.S:27:21: error: unsupported attribute in '.type' directive Log
openjdk-7 7u55-2.4.7-2callNative.S:27:21: error: unsupported attribute in '.type' directive Log
openmprtl 0.20131209-1Undetected errorLog
openmsx-catapult 0.10.0-1Undetected errorLog
otcl 1.14+dfsg-3tclInt.h:54:13: error: typedef redefinition with different types ('int' vs 'long') Log
pcp 3.9.4access.o: r .L.str : Error: additional symbol Log
pdftk 2.02-1javaprims.h:40:8: error: unknown linkage language Log
pencil2d 0.5.4~git20140416+dfsg-1Dependencies installation failed Log
pennmush 1.8.2p8-1.1atr_tab.c:217:19: error: operand of type 'void' where arithmetic or pointer type is required Log
phonon 4:4.7.1-1Undetected errorLog
pingus 0.7.6-1.1src/lisp/getters.hpp:33:15: error: no viable conversion from 'std::shared_ptr' to 'const lisp::Lisp *' Log
polybori 0.8.3-3Undetected errorLog
popplerkit.framework 0.0.20051227svn-7.1ld: warning: cannot find entry symbol _start; defaulting to 00000000004001c0 Log
postgresql-9.1 9.1.13-1configure: error: thread test program failed Log
postgresql-9.3 9.3.4-2configure: error: thread test program failed Log
prime-phylo 1.0.11-1PrimeOptionMap.hh:161:32: error: no function named 'operator<<' with type 'std::ostream &(std::ostream &, const beep::PrimeOptionMap &)' was found in the specified scope Log
py3cairo 1.10.0+dfsg-4Undetected errorLog
pypy 2.3.1+dfsg-1Undetected errorLog
python-cffi 0.8.1-1dh_auto_test: pybuild --test -i python{version}-dbg -p 2.7 --dir . returned exit code 13 Log
qca2 2.0.3-6Undetected errorLog
qt-gstreamer 0.10.2-2.1Undetected errorLog
qtconnectivity-opensource-src 5.3.0-2Undetected errorLog
qtkeychain 0.3.0-2Undetected errorLog
qtquick1-opensource-src 5.3.0-4Undetected errorLog
qtsvg-opensource-src 5.3.0-2Undetected errorLog
qtxmlpatterns-opensource-src 5.3.0-2Undetected errorLog
rampart 1.3.0-3error.c:91:5: error: implicitly declaring library function 'vsnprintf' with type 'int (char *, unsigned long, const char *, __va_list_tag *)' [-Werror] Log
rawtherapee 4.0.12+dfsg-2stdimagesource.cc:30:1: error: static data member definition cannot specify a storage class Log
reprepro 4.14.0-1sourceextraction.c:135:2: error: illegal storage class on function Log
rheolef 6.5-1:1352:2: error: 'register' storage class specifier is deprecated [-Werror,-Wdeprecated-register] Log
ruby1.8 1.8.7.358-13configure: error: in `/«PKGBUILDDIR»' Log
sam2p 0.49.2-2configure: error: cannot compute depends Log
samhain 3.1.0-5./src/sh_tiger1_64.c:375:3: error: inline assembly requires more registers than available Log
scantailor 0.9.11.1-1MatrixCalc.h:137:10: error: calling a private constructor of class 'mcalc::Mat' Log
scheme48 1.9-4Undetected errorLog
sheepdog 0.8.1-4sha1_ssse3.S:445:6: error: unexpected '.endm' in file, no current macro definition Log
sinfo 0.0.47-1bind.hpp:69:22: error: type 'void (*)(int) __attribute__((noreturn))' cannot be used prior to '::' because it has no members Log
sks-ecc 0.93-3tfm/mpi.c:2565:15: error: unknown register name '%cc' in asm Log
snapper 0.1.8-2stl_list.h:114:33: error: call to implicitly-deleted copy constructor of 'Client' Log
snappy 1.1.2-1Undetected errorLog
socat 1.7.2.3-1./xio.h:356:4: error: "unexpected size of off_t, please report this as bug" Log
styx 2.0.1-1sysbase1.c:579:50: error: invalid token at start of a preprocessor expression Log
supercollider 1:3.6.3~repack-6Undetected errorLog
suricata 2.0-1configure: error: pcre.h not found ... Log
tbb 4.2~20140122-1.1../../src/tbb/tools_api/ittnotify_config.h:267:33: error: unsupported inline asm: input with type 'long' matching output with type 'int' Log
tcc 0.9.26~git20120612.ad5f375-6libtcc1.c:673:45: error: too few arguments provided to function-like macro invocation Log
tclcl 1.20-8Undetected errorLog
tclex 1.2a1-16tclInt.h:54:13: error: typedef redefinition with different types ('int' vs 'long') Log
tdb 1.3.0-1.1Undetected errorLog
telepathy-logger-qt 0.8.0-2Undetected errorLog
telepathy-qt 0.9.3-4Undetected errorLog
tevent 0.9.21-1Undetected errorLog
tintii 2.8.2-1.1configure: error: required wxWidgets header not found Log
tpb 0.6.4-8Undetected errorLog
traverso 0.49.2-6Tsar.h:66:9: error: field has incomplete type 'void *[]' Log
triggerhappy 0.3.4-2make[1]: *** No rule to make target 'evtable_EV.h', needed by 'eventnames.o'. Stop. Log
troffcvt 1.04-21Undetected errorLog
tudu 0.8.2-1Undetected errorLog
ufraw 0.19.2-2ufraw_settings.cc:54:12: error: declaration of 'ufRawImage' with C language linkage conflicts with declaration in global scope Log
uwsgi 2.0.3-1NSObject.h:405:1: error: method has no return type specified; defaults to 'id' [-Werror,-Wmissing-method-return-type] Log
varconf 1.0.0-1Undetected errorLog
vboot-utils 0~20121212-3Undetected errorLog
vdr-plugin-xineliboutput 1.1.0-1make[2]: *** No rule to make target 'dbus/dbus-glib.h', needed by 'tools/gnome_screensaver.o'. Stop. Log
wesnoth-1.10 1:1.10.7-1Undetected errorLog
wesnoth-1.11 1:1.11.15-1Undetected errorLog
whois 5.1.3Undetected errorLog
worker 3.3.3-2configure: error: Log
wvstreams 4.6.1-7configure: error: in `/«PKGBUILDDIR»' Log
wxmaxima 13.04.2-4configure: error: Failed to compile a test program Log
xcftools 1.0.7-4Undetected errorLog
xdb 1.2.0-7.2dh_install: libxdb1 missing files (debian/tmp/usr/lib/*.so.*), aborting Log
xen 4.3.0-3RuntimeError: Can't find /usr/src/linux-support-3.10-3, please install the linux-support-3.10-3 package Log
xhprof 0.9.4-1configure: error: in `/«PKGBUILDDIR»/extension' Log
xmpi 2.2.3b8-13.1configure: error: cannot continue -- cannot find Trillium header files Log
xsd 3.3.0.2-3static-ptr.hxx:63:28: error: cannot allocate function type 'Cult::MM::KeyList ()' with new Log
yafaray 0.1.5-3mathOptimizations.h:125:3: error: ambiguous instructions require an explicit suffix (could be 'flds', 'fldl', or 'fldt') Log
yap 6.2.2-2configure: error: in `/«PKGBUILDDIR»/arch' Log
z80ex 1.1.21-1dh_install: libz80ex-dev missing files (usr/lib/lib*.a), aborting Log
zeitgeist 0.9.14-2indexer.cpp:685:13: error: cannot cast from type 'gboolean (ZeitgeistFTS::Indexer::*)()' to pointer type 'GSourceFunc' (aka 'gboolean (*)(gpointer)') Log
zeroc-ice 3.5.1-6lex.yy.c:805:2: error: 'register' storage class specifier is deprecated [-Werror,-Wdeprecated-register] Log
zimlib 1.2-2Undetected errorLog
zzuf 0.13.svn20100215-4Undetected errorLog
269 errors
Return to the list