Debian Package rebuild

Rebuild of the Debian archive with clang

"Not categorized" build failure(s)
clang 3.6.0
Return to the list

Versions: 2.9 - 3.0 - 3.1 - 3.2 - 3.3 - 3.4 - 3.4.2 - 3.5.0 - 3.6.0 - 3.8.1
PackageVersionSupposed error messageFull log Bug report
389-dsgw 1.1.11-1../edit.c:30:5: error: third parameter of 'main' (environment) must be of type 'char **' Log
9base 1:6-6n1.c:124:5: error: unterminated function-like macro invocation Log
aces3 3.0.8-4Undetected errorLog
aconnectgui 0.9.0rc2-1-9configure: error: Sufficiently new version of libasound not found. Log 684508
acpid 1:2.0.23-2configure: error: "asprintf() not found" Log
activiz.net 1:1.0~git20111214-2stddef.h:57:39: error: missing binary operator before token "(" Log
aegis 4.24.3-3Undetected errorLog
aeskulap 0.2.2b1-13./poolinstance.h:53:25: error: no function named 'remove_instance' with type 'void (const Glib::RefPtr &)' was found in the specified scope Log
agda 2.4.0.2-2Undetected errorLog
apbs 1.4-1Undetected errorLog
aplus-fsf 4.22.1-6../MSTypes/MSFloatMatrix.H:30:7: error: template specialization requires 'template<>' Log
apq-postgresql 3.2.0-3Undetected errorLog
apt 1.0.9.7Tests failures Log
apt-cacher-ng 0.8.0-3Undetected errorLog
aptitude 0.6.11-1configure: error: in `/«PKGBUILDDIR»/build-arch' Log
aqemu 0.8.2-2VM.cpp:4566:75: error: reference to type 'const QString' could not bind to an rvalue of type 'bool' Log
arj 3.10.22-12Undetected errorLog
ark 4:4.14.2-2Dependencies installation failed Log
aspectc++ 1:1.2-1stddef.h:57: error: unexpected token `(' in conditional Log
atlas 3.10.2-7Undetected errorLog
ats2-lang 0.1.8-1Undetected errorLog
autodocksuite 4.2.6-2configure: error: in `/«PKGBUILDDIR»/autodock' Log
avifile 1:0.7.48~20090503.ds-16.2common/avm_output.cpp:20:12: error: qualified reference to 'AvmOutput' is a constructor name rather than a type wherever a constructor can be declared Log
bibledit-gtk 4.6-1mainwindow.cpp:195:25: error: extern declaration of 'accelerator_group' follows non-extern declaration Log
binutils-arm-none-eabi 5dh_auto_test: make -j10 check returned exit code 2 Log
blas 1.2.20110419-10Undetected errorLog
blktap 2.0.90-3libvhd.c:1073:2: error: indirection of non-volatile null pointer will be deleted, not trap [-Werror,-Wnull-dereference] Log
boinc 7.4.23+dfsg-2configure: error: in `/«BUILDDIR»/boinc-7.4.23+dfsg' Log
bomberclone 0.11.9-4../include/gfx.h:108:20: error: inline function 'gfx_blitupdaterectclear' is not defined [-Werror,-Wundefined-inline] Log
boswars 2.7-1Dependencies installation failed Log
cernlib 20061220+dfsg3-4.1Undetected errorLog
cgal 4.5-2Tests failures Log
cigi-ccl 3.3.3a+svn818-8dh_install: libcigicl-dev missing files (usr/lib/*/pkgconfig/*), aborting Log
cinnamon 2.2.16-5st/st-background-effect.c:240:28: error: invalid suffix 'd' on floating constant Log
clisp 1:2.49-10clang: error: clang frontend command failed with exit code 70 (use -v to see invocation) Log
cmdpack 1.03-1src/banner.h:7:2: error: embedding a #include directive within macro arguments is not supported Log
cmocka 0.4.1-2Dependencies installation failed Log
codeblocks 13.12-3../../src/include/cbthreadpool.h:140:33: error: exception specification is not available until end of class definition Log
coinor-flopc++ 1.0.6-3.1./MP_domain.hpp:180:18: error: return type of virtual function 'getSet' is not covariant with the return type of the function it overrides ('flopc::MP_set_base' is incomplete) Log
comedilib 0.10.2-2clang: error: clang frontend command failed with exit code 70 (use -v to see invocation) Log
cone 0.89-1cursesmessage.C:3764:18: error: cannot create a non-constant pointer to member function Log
cook 2.33-1Undetected errorLog
cpl-plugin-kmos 1.3.5+dfsg-1dh_auto_test: make -j1 check returned exit code 2 Log
cpl-plugin-muse 1.0.1+dfsg-1DEPS Log
cpl-plugin-vimos 2.9.15+dfsg-1DEPS Log
cpputest 3.4-3././include/CppUTest/MemoryLeakDetectorNewMacros.h:54:9: error: keyword is hidden by macro definition [-Werror,-Wkeyword-macro] Log
csound 1:6.03.2~dfsg-1Undetected errorLog
cssc 1.4.0-1dh_auto_test: make -j10 check returned exit code 2 Log
cvs 2:1.12.13+real-15Dependencies installation failed Log
dacs 1.4.28b-3Undetected errorLog
davix 0.4.0-1Tests failures Log
dicom3tools 1.00~20140902075059-1./Imakefile:171:3: error: invalid preprocessing directive Log
dietlibc 0.33~cvs20120325-6x86_64/strcpy.S:2:8: error: alignment must be a power of 2 Log
din 5.2.1-3main.cc:296:49: error: non-aggregate type 'const color' cannot be initialized with an initializer list Log
dmapi 2.2.10-1Undetected errorLog
docker.io 1.3.3~dfsg1-2Undetected errorLog
doxymacs 1.8.0-6.1clang: error: optimization flag '-fexpensive-optimizations' is not supported Log
ekg2 1:0.4~pre+20120506.1-8Makefile.am:144: error: 'plugins/autoresponder/autoresponder.la' is not a standard libtool library name Log
ember 0.6.2+dfsg-2.1CEGUIWindowFactoryManager.h:486:9: error: cannot catch reference to incomplete type 'CEGUI::Exception' Log
encfs 1.7.4-5configure: error: in `/«PKGBUILDDIR»' Log
esys-particle 2.3-2./SphAggGougeBlock.hpp:39:37: error: no viable conversion from '__normal_iterator' to '__normal_iterator' Log
felix-latin 2.0-7Dependencies installation failed Log
fftw3 3.3.4-2openmp.c:26:2: error: OpenMP enabled but not using an OpenMP compiler Log
freefem3d 1.0pre10-3.2libtool.m4: error: problem compiling CXX test program Log
freefoam 0.1.0+dfsg+1-3Pstream.H:518:29: error: no function named 'reduce' with type 'void (scalar &, const sumOp &)' was found in the specified scope Log
freetype 2.5.2-4./builds/unix/ftconfig.h:532:5: error: 'long long' is an extension when C99 mode is not enabled [-Werror,-Wlong-long] Log
fsvs 1.2.5-1configure: error: in `/«PKGBUILDDIR»' Log
fusioninventory-agent 1:2.3.10.1-1Dependencies installation failed Log
fvwm 1:2.6.5.ds-4configure: error: " Log
gbsplay 0.0.91-1Undetected errorLog
gcc-snapshot 20150319-1configure: error: GNAT is required to build ada Log
gdal 1.10.1+dfsg-8gdal_wrap.cpp:4494:12: error: assigning to 'char *' from incompatible type 'const char *' Log
gdcm 2.4.4-3stddef.h:57:39: error: missing binary operator before token "(" Log
gdis 0.90-5Dependencies installation failed Log 728454
geant321 1:3.21.14.dfsg-11Undetected errorLog
geomview 1.9.4-4.1Dependencies installation failed Log
gforth 0.7.2+dfsg1-1.1Undetected errorLog
ggcov 0.9-6Tests failures Log
giftrans 1.12.2-18Undetected errorLog
glib2.0 2.42.1-1Undetected errorLog
glibmm2.4 2.42.0-1Undetected errorLog
glusterfs 3.5.2-2Dependencies installation failed Log
gmerlin 1.2.0~dfsg+1-4bgyadif.c:769:9: error: ambiguous instructions require an explicit suffix (could be 'cmpb', 'cmpw', 'cmpl', or 'cmpq') Log
gnash 0.8.11~git20140708-3agg_scanline_u.h:476:30: error: type 'base_type' (aka 'agg::scanline_u8') is not a direct or virtual base of 'scanline32_u8_am' Log
gnat-4.9 4.9.2-1configure: error: GNAT is required to build ada Log
gnat-mingw-w64 15configure: error: GNAT is required to build ada Log
gnucap 1:0.36~20091207-2./mg_.h:134:19: error: variable has incomplete type 'C_Comment' Log
golang 2:1.3.3-1Undetected errorLog
golang-go.tools 0.0~hg20140703-4Dependencies installation failed Log
google-glog 0.3.3-2Tests failures Log
gprolog 1.3.0-6.1Undetected errorLog
gpsshogi 0.6.0-3+nmu1Dependencies installation failed Log
gravit 0.5.1+dfsg-2Dependencies installation failed Log
gringo 4.4.0-1Undetected errorLog
grml2usb 0.14.10.1mbr.S:38:16: error: unexpected token in argument list Log
grub 0.97-70configure: error: GRUB requires GAS .code16 addr32 support; upgrade your binutils Log
grub2 2.02~beta2-22Undetected errorLog
guile-1.8 1.8.8+1-10dh_auto_test: make -j10 check returned exit code 2 Log
gummiboot 45-2efibind.h:29:10: error: Compiler is too old for GNU_EFI_USE_MS_ABI Log
guymager 0.7.3-3aewf.cpp:141:12: error: field has incomplete type 'uint []' Log
gxneur 0.17.0-1misc.c:101:20: error: variable 'all_modifiers' is not needed and will not be emitted [-Werror,-Wunneeded-internal-declaration] Log
hardening-wrapper 2.7dh_auto_test: make -j1 check returned exit code 2 Log
haskell-cabal 1.20.0.2-1Dependencies installation failed Log
haskell-categories 1.0.6-1Undetected errorLog
haskell-conduit 1.1.6-1Undetected errorLog
haskell-esqueleto 1.4.1.2-1Undetected errorLog
haskell-fclabels 1.1.4.3-2Undetected errorLog
haskell-gluraw 1.3.0.0-2Undetected errorLog
haskell-ltk 0.12.1.0-3Undetected errorLog
haskell-network 2.4.1.2-2Undetected errorLog
haskell-notmuch-web 0.2.0-7Undetected errorLog
haskell-openglraw 1.3.0.0-2Undetected errorLog
haskell-parallel 3.2.0.4-1Undetected errorLog
haskell-shake 0.13.2+dfsg-3Dependencies installation failed Log
haskell-text 0.11.3.1-1Undetected errorLog
haskell-uniplate 1.6.11-2Undetected errorLog
haskell-vector 0.10.0.1-3Undetected errorLog
haskell-vector-space 0.8.6-3Undetected errorLog
haskell-yesod-form 1.3.15-1Undetected errorLog
haxml 1:1.23.3-2Undetected errorLog
helpviewer.app 0.3-8clang: error: invalid value 'ISO-8859-1' in '-finput-charset=ISO-8859-1' Log
hnb 1.9.18-10prefs.c:92:2: error: embedding a #include directive within macro arguments is not supported Log
hpsockd 0.17Dependencies installation failed Log
hugs98 98.200609.21-5.3tools/make_bootlib: 68: tools/make_bootlib: -D__HUGS__: not found Log
hylafax 3:6.0.6-6Undetected errorLog
idjc 0.8.14-1configure: error: "math library is missing critical function" Log
igraph 0.7.1-2dh_auto_test: make -j10 check returned exit code 2 Log
imvirt 0.9.6-1vmware.c:65:5: error: invalid operand for instruction Log
insighttoolkit4 4.6.0-3stddef.h:57:39: error: missing binary operator before token "(" Log
intel-vaapi-driver 1.4.1-2Undetected errorLog
judy 1.0.5-4configure: error: in `/«PKGBUILDDIR»' Log
kannel 1.4.3-2test/test_octstr_format.c:66:28: error: integer literal is too large to be represented in any integer type Log
kde-style-qtcurve 1.8.14-3Dependencies installation failed Log
laserboy 2012.11.11-1LaserBoy_frame_set.hpp:259:38: error: parameter of overloaded 'operator++' cannot have a default argument Log
lcgdm 1.8.9-1Undetected errorLog
lensfun 0.2.8-2lensfun.h:68:13: error: "I don't know how to change symbol visibility for your compiler" Log
libalog 0.5.0-1Tests failures Log
libapache2-mod-perl2 2.0.9~1624218-2Tests failures Log
libb-hooks-parser-perl 0.12-1Tests failures Log
libcrypto++ 5.6.1-6gcm.cpp:607:3: error: invalid operand for instruction Log
libdbi-drivers 0.9.0-3Undetected errorLog
libgnatcoll 1.6gpl2014-6Undetected errorLog
libguestfs 1:1.28.6-1Undetected errorLog
libindi 0.9.8.1-5.1mathcalls.h:309:14: error: exception specification in declaration does not match previous declaration Log
libkolabxml 1.0.2-2Dependencies installation failed Log
libncursesada 5.9.20140726-1configure: error: No usable Ada compiler found Log
liboil 0.3.17-2wavelet.c:1759:27: error: invalid use of a cast in a inline asm context requiring an l-value: remove the cast or build with -fheinous-gnu-extensions Log
libomxalsa 0.1-2configure: error: POSIX threads support is required Log
libomxcamera 0.1-2configure: error: in `/«PKGBUILDDIR»' Log
libomxfbdevsink 0.1-2configure: error: in `/«PKGBUILDDIR»' Log
libomxil-bellagio 0.9.3-2configure: error: libdl is required Log
libomxmad 0.1-1configure: error: POSIX threads support is required Log
libomxvideosrc 0.1-1configure: error: in `/«PKGBUILDDIR»' Log
libomxvorbis 0.1-3configure: error: in `/«PKGBUILDDIR»' Log
libomxxvideo 0.1-3configure: error: POSIX threads support is required Log
libosl 0.6.0-3.1clang: error: optimization flag '-funswitch-loops' is not supported Log
librg-blast-parser-perl 0.03-2blast-parser-driver.h:61:12: error: 'token_type' (aka 'rostlab::blast::parser::token::yytokentype') is not a class, namespace, or scoped enumeration Log
librostlab-blast 1.0.1-3./rostlab/blast-parser-driver.h:61:12: error: 'token_type' (aka 'rostlab::blast::parser::token::yytokentype') is not a class, namespace, or scoped enumeration Log
libs3 2.0-2inc/request.h:131:14: error: sizeof on pointer operation will return size of 'char *' instead of 'char [9]' [-Werror,-Wsizeof-array-decay] Log
libtemplates-parser 11.8.2014-3DEPS Log
libtomcrypt 1.17-6./src/headers/tomcrypt_macros.h:269:24: error: constraint 'I' expects an integer constant expression Log
libv8-3.14 3.14.5.8-8.1../src/../include/v8.h:2990:5: error: anonymous types declared in an anonymous union are an extension [-Werror,-Wnested-anon-types] Log
libvirt 1.2.9-9Tests failures Log
libvpx 1.3.0-3vp8_asm_enc_offsets.c:23:1: error: unexpected token in argument list Log
libwx-perl 1:0.9923-4Undetected errorLog
libwx-scintilla-perl 0.39-1Undetected errorLog
libzypp 14.29.1-2SolvIterMixin.h:167:60: error: invalid use of incomplete type 'zypp::asPoolItem' Log
lierolibre 0.5-1src/gvl/io/encoding.hpp:586:19: error: cast from pointer to smaller type 'uint32_t' (aka 'unsigned int') loses information Log
lightspark 0.7.2-6Undetected errorLog
lookup 1.08b-11lib/romaji2kana.c:59:12: error: source file is not valid UTF-8 Log
lordsawar 0.2.0-2.1armyproto.cpp:39:34: error: array initializer must be an initializer list Log
lowpan-tools 0.3-1Dependencies installation failed Log
m4 1.4.17-4dh_auto_test: make -j1 check returned exit code 2 Log
mailutils 1:2.99.98-2Dependencies installation failed Log
mandelbulber 1:1.21.1-1.1../src/Render3D.cpp:1412:25: error: non-aggregate type 'CVector3' cannot be initialized with an initializer list Log
mayavi2 4.3.1-3.1DEPS Log
mclibs 20061220+dfsg3-3Undetected errorLog
memcached 1.4.21-1.1Tests failures Log
memtest86 4.3.7-2main.c:229:2: error: indirect goto in function with no address-of-label expressions Log
memtest86+ 5.01-2main.c:223:2: error: indirect goto in function with no address-of-label expressions Log
mesa 10.4.2-2clang: error: clang frontend command failed with exit code 70 (use -v to see invocation) Log
minc 2.2.00-6dh_auto_test: make -j1 check returned exit code 2 Log 741744
mira 4.0.2-1clang: error: argument to '-V' is missing (expected 1 value) Log
mknbi 1.4.4-10Undetected errorLog
mldemos 0.5.1-3./SECovarianceFunction.h:23:13: error: field has incomplete type 'float []' Log
mlpy 2.2.0~dfsg1-2.1DEPS Log
moc 1:2.5.0-1Dependencies installation failed Log
mosh 1.2.4a-1mosh-server.cc:577:19: error: expression with side effects will be evaluated despite being used as an operand to 'typeid' [-Werror,-Wpotentially-evaluated-expression] Log
mpich2 1.4.1-4.2configure: error: Cannot build shared libraries with this compiler Log
mrs 6.0.5+dfsg-1Undetected errorLog
musl 1.1.5-1dh_install: musl-tools missing files (usr/bin/*), aborting Log
mwrap 0.33-2Tests failures Log
mypaint 1.1.0-3ImportError: ../_mypaintlib.so: undefined symbol: _ZN10BufferCompIL20BufferCompOutputType1ELj16384E12HueBlendModeE9blendfuncE Log
ncmpcpp 0.5.10-2./screen.h:265:3: error: cannot initialize object parameter of type 'NCurses::Window' with an expression of type 'NCurses::Scrollpad' Log
nescc 1.3.5-1Dependencies installation failed Log
newsbeuter 2.8-2Dependencies installation failed Log
nfstrace 0.3.1-2breakdown_analyzer.cpp:304:18: error: 'flush_statistics' overrides a member function but is not marked 'override' [-Werror,-Winconsistent-missing-override] Log
nn 6.7.3-8make[2]: *** No rule to make target ' articles.h', needed by 'nn.o'. Stop. Log
npapi-vlc 2.0.6-4./control/nporuntime.h:225:13: error: static declaration of 'RuntimeNPClassGetProperty' follows non-static declaration Log
ns2 2.35+dfsg-2common/tclAppInit.cc:240:26: error: declaration of 'globalMemTrace' has a different language linkage Log
obby 0.4.8-1../inc/zeroconf_avahi.hpp:135:40: error: assigning to 'AvahiWatchEvent' from incompatible type 'int' Log
obexftp 0.23-4bfb_io.c:415:44: error: hex escape sequence out of range Log
oce 0.15-5Tests failures Log
octave-optim 1.4.0-1Undetected errorLog
ogmrip 1.0.1-1ogmrip-encoding.c:1200:7: error: cast to union type from type 'int' not present in union Log
ola 0.9.1-1.1EnttecUsbProWidget.cpp:422:5: error: unused typedef 'widget_parameters_reply' [-Werror,-Wunused-local-typedef] Log
open-cobol 1.1-1dh_auto_test: make -j1 check returned exit code 2 Log
openhpi 2.14.1-1.4ipmi.cpp:1563:83: error: alias must point to a defined variable or function Log
openjdk-8 8u40-b27-1configure: error: GCC compiler is required. Try setting --with-tools-dir. Log
openlibm 0.4+dfsg-1Tests failures Log
openmpi 1.6.5-9.2Dependencies installation failed Log
openmprtl 0.20140926-1Undetected errorLog
openmsx-catapult 0.10.1-2Undetected errorLog
openvswitch 2.3.0+git20140819-3../lib/ovs-atomic.h:320:5: error: address argument to atomic operation must be a pointer to integer or pointer ('atomic_uint *' (aka '_Atomic(unsigned int) *') invalid) Log
paw 1:2.14.04.dfsg.2-9Undetected errorLog
pcp 3.10.1access.o: r .L.str : Error: additional symbol Log
pcsc-cyberjack 3.99.5final.sp05-2CCIDReader.cpp:3118:77: error: invalid use of non-static data member 'abData' Log
pdf2htmlex 0.12+ds-1Undetected errorLog
pdftk 2.02-2javaprims.h:40:8: error: unknown linkage language Log
pdns-recursor 3.6.2-2Dependencies installation failed Log
pearpc 0.5.dfsg-2.1jitc_mmu.S:36:1: error: '.intel_syntax prefix' is not supported: registers must not have a '%' prefix in .intel_syntax Log
pennmush 1.8.2p8-1.1atr_tab.c:217:19: error: operand of type 'void' where arithmetic or pointer type is required Log
pgrouting 2.0.0-3DEPS Log
pingus 0.7.6-2src/lisp/getters.hpp:33:15: error: no viable conversion from 'std::shared_ptr' to 'const lisp::Lisp *' Log
pixman 0.32.6-3../../pixman/pixman-mmx.c:100:20: error: constraint 'K' expects an integer constant expression Log
player 3.0.2+dfsg-4.2rflex.cc:319:1: error: static data member definition cannot specify a storage class Log
plplot 5.10.0+dfsg-1Undetected errorLog
poedit 1.6.10-2regex_compiler.h:413:20: error: non-type template argument is not a constant expression Log
polybori 0.8.3-5PyPolyBoRi/monomial_wrapper.cc:50:64: error: call to non-static member function without an object argument Log
popplerkit.framework 0.0.20051227svn-7.1ld: warning: cannot find entry symbol _start; defaulting to 00000000004001c0 Log
pork 0.99.8.1-2.2Dependencies installation failed Log
postgresql-9.1 9.1.15-0+deb8u1configure: error: thread test program failed Log
postgresql-9.4 9.4.1-1configure: error: thread test program failed Log
prime-phylo 1.0.11-2PrimeOptionMap.hh:161:32: error: no function named 'operator<<' with type 'std::ostream &(std::ostream &, const beep::PrimeOptionMap &)' was found in the specified scope Log
py3cairo 1.10.0+dfsg-4Undetected errorLog
pymol 1.7.2.1-1layer0/Map.c:246:3: error: unterminated function-like macro invocation Log
pypy 2.4.0+dfsg-3Undetected errorLog
python-admesh 0.98.1-1error: [Errno 2] No such file or directorygenerating cadmesh.pxd and admesh.pyx Log
python-cffi 0.8.6-1Tests failures Log
python-enable 4.3.0-2Undetected errorLog
python-srp 1.0.4-1DEPS Log
qlandkartegt 1.7.7-3Dictionary.h:69:46: error: call to non-static member function 'left2right' of 'Dictionary' from nested type 'iterator_base' Log
qpdfview 0.4.12-1qalgorithms.h:300:28: error: invalid operands to binary expression ('int' and 'qpdfview::BookmarkItem') Log
rawtherapee 4.2-1dcraw.cc:8728:11: error: '(anonymous union at /«PKGBUILDDIR»/rtengine/dcraw.cc:8728:11)' cannot be defined in a type specifier Log
regina-normal 4.96-2ninteger.h:2294:16: error: assigning to 'mpz_ptr' (aka '__mpz_struct *') from incompatible type 'mpz_t *' (aka '__mpz_struct (*)[1]') Log
reprepro 4.16.0-1sourceextraction.c:135:2: error: illegal storage class on function Log
resiprocate 1:1.9.7-4Dependencies installation failed Log
rheolef 6.5-1:1352:2: error: 'register' storage class specifier is deprecated [-Werror,-Wdeprecated-register] Log
root-system 5.34.19+dfsg-1.2NameLookup.cxx:243:32: error: declaration of reference variable 'name' requires an initializer Log
sam2p 0.49.2-3configure: error: cannot compute depends Log
scantailor 0.9.11.1-2MatrixCalc.h:127:10: error: calling a private constructor of class 'mcalc::Mat' Log
scheme48 1.9-5Dependencies installation failed Log
sflphone 1.4.1-0.1configure: error: dbus does not compile when clang is used, rerun with --without-dbus Log
sheepdog 0.8.3-4:1:9: error: unknown token in expression Log
sinfo 0.0.47-3bind.hpp:69:22: error: type 'void (*)(int) __attribute__((noreturn))' cannot be used prior to '::' because it has no members Log
sks-ecc 0.93-3tfm/mpi.c:2565:15: error: unknown register name '%cc' in asm Log
snapper 0.2.4-1stl_list.h:114:33: error: call to implicitly-deleted copy constructor of 'Client' Log
snappy 1.1.2-4Undetected errorLog
sofa-framework 1.0~beta4-9../../../modules/sofa/component/topology/QuadSetGeometryAlgorithms.h:113:14: error: inline declaration of 'areaProduct' follows non-inline definition Log
sphinxbase 0.8-6Dependencies installation failed Log
stoken 0.6-1configure: error: in `/«PKGBUILDDIR»' Log
styx 2.0.1-1sysbase1.c:579:50: error: invalid token at start of a preprocessor expression Log
supercollider 1:3.6.6~repack-2-1Undetected errorLog
suricata 2.0.7-2configure: error: pcre.h not found ... Log
tbb 4.2~20140122-5../../src/tbb/tools_api/ittnotify_config.h:267:33: error: unsupported inline asm: input with type 'long' matching output with type 'int' Log
tclcl 1.20-8Dependencies installation failed Log
tpb 0.6.4-8Undetected errorLog
traverso 0.49.4-1Tsar.h:66:9: error: field has incomplete type 'void *[]' Log
troffcvt 1.04-21Undetected errorLog
tudu 0.8.2-1Undetected errorLog
turnserver 0.7.3-2turnserver.c:959:57: error: size argument in 'memcmp' call is a comparison [-Werror,-Wmemsize-comparison] Log
undertaker 1.6-2./ConditionalBlock.h:96:65: error: member function 'getDefines' not viable: 'this' argument has type 'const CppFile', but function is not marked const Log
upx-ucl 3.91-1./bele_policy.h:156:9: error: unused typedef 'acc_cta_t__39' [-Werror,-Wunused-local-typedef] Log
vboot-utils 0~20121212-3Tests failures Log
vdr-plugin-xineliboutput 1.1.0-2make[2]: *** No rule to make target 'dbus/dbus-glib.h', needed by 'tools/gnome_screensaver.o'. Stop. Log
wesnoth-1.10 1:1.10.7-1Undetected errorLog
wesnoth-1.12 1:1.12.1-1Undetected errorLog
worker 3.4.1-1configure: error: Log
wvdial 1.61-4.1uniconfgen.h:323:19: error: no class named 'Iter' in 'UniConfGen' Log
wvstreams 4.6.1-7./include/wvscatterhash.h:186:46: error: invalid use of non-static data member 'xstatus' Log
x11-apps 7.7+4Dependencies installation failed Log
xbase64 3.1.2-5Undetected errorLog
xbubble 0.5.11.2-3.2clang: error: optimization flag '-finline-functions' is not supported Log
xcftools 1.0.7-4Undetected errorLog
xemacs21 21.4.22-11./lisp.h:204:3: error: typedef redefinition with different types ('union max_align_t' vs 'struct max_align_t') Log
xhprof 0.9.4-2configure: error: in `/«PKGBUILDDIR»/extension' Log
xmpi 2.2.3b8-13.2configure: error: cannot continue -- cannot find Log
yoshimi 1.3.3-1SynthEngine.h:153:32: error: invalid use of non-static data member 'values' Log
z80ex 1.1.21-1dh_install: libz80ex-dev missing files (usr/lib/lib*.a), aborting Log
zeitgeist 0.9.14-2.2indexer.cpp:685:13: error: cannot cast from type 'gboolean (ZeitgeistFTS::Indexer::*)()' to pointer type 'GSourceFunc' (aka 'gboolean (*)(gpointer)') Log
zeroc-ice 3.5.1-6lex.yy.c:805:2: error: 'register' storage class specifier is deprecated [-Werror,-Wdeprecated-register] Log
zypper 1.11.13-1SolvIterMixin.h:167:60: error: invalid use of incomplete type 'zypp::asPoolItem' Log
zzuf 0.13.svn20100215-4.1Undetected errorLog
293 errors
Return to the list