Debian Package rebuild

Rebuild of the Debian archive with clang

"Not categorized" build failure(s)
clang 3.1
Return to the list

Versions: 2.9 - 3.0 - 3.1 - 3.2 - 3.3 - 3.4 - 3.4.2 - 3.5.0 - 3.6.0 - 3.8.1
PackageVersionSupposed error messageFull log Bug report
0ad 0~r11863-2Undetected errorLog
abcm2ps 5.9.25-1Dependencies installation failed Log
aconnectgui 0.9.0rc2-1-9configure: error: Sufficiently new version of libasound not found. Log 684508
aegis 4.24.3-3test/02/t0289a-walt.sh: 23: .: test_funcs: not found Log
aegisub 2.1.9-1Undetected errorLog
aeskulap 0.2.2b1-11./poolinstance.h:53:25: error: no function named 'remove_instance' with type 'void (const Glib::RefPtr &)' was found in the specified scope Log
agave 0.4.7-2.1refptr.h:208:16: error: member access into incomplete type 'gcs::PaletteTreeModel' Log
allegro4.2 2:4.2.2-3Dependencies installation failed Log
altos 1.0.3Undetected errorLog
aplus-fsf 4.22.1-4.2../MSTypes/MSFloatMatrix.H:30:1: error: template specialization requires 'template<>' Log
apron 0.9.10-5.2ppl.hh:14384:15: error: flexible array member 'vec_' of non-POD element type 'Coefficient []' Log
aqemu 0.8.2-2VM.cpp:4566:75: error: reference to type 'const QString' could not bind to an rvalue of type 'bool' Log
arj 3.10.22-10Undetected errorLog
asc 2.4.0.0-3movementtest.cpp:23:4: error: right operand to ? is void, but left operand is of type 'int' Log
aspectc++ 1:1.1+svn20120529-1limits.h:36: error: unexpected token `(' in conditional Log
aster 10.6.0-1-4Undetected errorLog
atlas 3.8.4-7dasum.c:179:5: error: "This kernel requires SSE2" Log
atom4 4.1-5.1engine/ai.cc:343:1: error: control reaches end of non-void function [-Werror,-Wreturn-type] Log 710408
ats-lang-anairiats 0.2.6-1Undetected errorLog
avifile 1:0.7.48~20090503.ds-12common/avm_output.cpp:20:12: error: qualified reference to 'AvmOutput' is a constructor name rather than a type wherever a constructor can be declared Log
ax25-tools 0.0.10-rc2+cvs20120204-3./rip98d.h:47:12: error: restrict requires a pointer or reference Log
ball 1.4.1+20111206-3global.h:39:38: error: token is not a valid binary operator in a preprocessor subexpression Log 755225
base-passwd 3.5.24Dependencies installation failed Log
baycomusb 0.10-12.1Undetected errorLog
binutils-avr 2.20.1-2Undetected errorLog
binutils-mingw-w64 2Undetected errorLog
binutils-msp430 2.22~msp20120406-2 Log
binutils-z80 2.22-3Dependencies installation failed Log
bisonc++ 4.01.00-1bisonc++.cc:14:9: error: initialization of non-aggregate type 'Arg::LongOption' (aka 'FBB::LongOption__') with an initializer list Log
blacs-mpi 1.1-31blacsF77init_MPI-LINUX-0.a: could not read symbols: Archive has no index; run ranlib to add one Log
blas 1.2.20110419-5Undetected errorLog
blktap 2.0.90-1libvhd.c:1073:2: error: indirection of non-volatile null pointer will be deleted, not trap [-Werror,-Wnull-dereference] Log
boinc-app-seti 6.12~svn1305-2vector/x86_ops.h:135:42: error: type of machine mode does not match type of base type Log
bomberclone 0.11.9-4configure: error: Log
botan1.8 1.8.13-4Undetected errorLog
busybox 1:1.20.0-4findutils/find.c:904:2: error: illegal storage class on function Log
cabal-debian 1.25-1Undetected errorLog
cadabra 1.29-1./youngtab.hh:587:23: error: use of non-static data member 'rows' of 'filled_tableau' from nested type 'iterator' Log
cairo 1.12.2-2cairo-mutex-impl-private.h:262:3: error: "XXX: No mutex implementation found. Cairo will not work with multiple threads. Define CAIRO_NO_MUTEX to 1 to acknowledge and accept this limitation and compile cairo without thread-safety support." Log
camomile 0.8.4-1Undetected errorLog
cbmc 4.1-1.2../goto-programs/goto_program_template.h:333:30: error: invalid use of incomplete type 'contextt' Log
ccrypt 1.9-4Undetected errorLog
cdebconf 0.167Dependencies installation failed Log
cegui-mk2 0.7.6-2../../cegui/include/CEGUIWindowFactoryManager.h:486:9: error: cannot catch reference to incomplete type 'CEGUI::Exception' Log
ceph 0.44.1-1./include/interval_set.h:90:35: error: no class named 'const_iterator' in 'interval_set' Log 749083
chicken 4.7.0-1 Log
cmdpack 1.03-1src/banner.h:7:2: error: embedding a #include directive within macro arguments is not supported Log
coinor-cbc 2.5.0-2.3 Log
coinor-flopc++ 1.0.6-3.1./MP_domain.hpp:180:18: error: return type of virtual function 'getSet' is not covariant with the return type of the function it overrides ('flopc::MP_set_base' is incomplete) Log
comedilib 0.10.0-3Undetected errorLog
condor 7.8.1~dfsg.1-1HashTable.h:264:23: error: invalid operands to binary expression ('ThreadInfo' and 'const ThreadInfo') Log
cook 2.33-1Undetected errorLog
coriander 2.0.1-1configure: error: The XV overlay libraries were not found Log
cpl 6.1.1-2cpl_column.c:12926:29: error: cannot compile this complex compound assignment yet Log
cpuburn 1.4a-3burnK7.S:83:10: error: unexpected token in '.fill' directive Log
crash 6.0.6-1 Log
csound 1:5.17.11~dfsg-1Undetected errorLog
cups 1.5.3-2Undetected errorLog
cvm 0.96-1Undetected errorLog
cython 0.15.1-2Undetected errorLog
dacs 1.4.27b-1Undetected errorLog
darcs-monitor 0.3.8-2unsatisfiable build-dependency: libghc6-haxml-dev (< 1:1.14) but 1:8 is to be installed Log
db1-compat 2.1.3-15Dependencies installation failed Log
db4.8 4.8.30-12libtool.m4: error: problem compiling CXX test program Log
ddd 1:3.3.12-3 Log 755226
dicom3tools 1.0~20120505-1./Imakefile:163:3: error: invalid preprocessing directive Log
discount 2.1.3-3Undetected errorLog
dmapi 2.2.10-1Undetected errorLog
dolfin 1.0.0-6ErrorControl.h:195:40: error: no function named 'adapt' with type 'const dolfin::ErrorControl &(const dolfin::ErrorControl &, boost::shared_ptr, bool)' was found in the specified scope Log
drift 2.2.3-2.1 Could not find module `System' Log
drizzle 1:7.1.36-stable-1drizzled/cursor.cc:1339:7: error: unknown flag Log
dvdisaster 0.72.4-1Undetected errorLog
ember 0.6.2+dfsg-2CEGUIWindowFactoryManager.h:486:9: error: cannot catch reference to incomplete type 'CEGUI::Exception' Log
enigma 1.10~~pre-alpha+r2236-1./ecl_dict.hh:134:27: error: calling a private constructor of class 'ecl::XInvalidKey' Log
esys-particle 2.1-4./SphAggGougeBlock.hpp:39:37: error: no viable conversion from 'const_iterator' (aka '__normal_iterator, std::allocator > > >') to 'vector::iterator' (aka '__normal_iterator, std::allocator > > >') Log
etl 0.04.15-1Undetected errorLog
etsf-io 1.0.3-4configure: error: "No 'NetCDF' library found." Log
evolvotron 0.6.1-2Undetected errorLog
ext3grep 0.10.1-3.2Undetected errorLog 755542
fbreader 0.12.10dfsg-6Library.cpp:42:10: error: qualified reference to 'Library' is a constructor name rather than a type wherever a constructor can be declared Log
ferret-vis 6.6.2-1.1Undetected errorLog
fftw3 3.3.2-3configure: error: don't know how to enable OpenMP Log
file-browser-applet 0.6.6-1Dependencies installation failed Log
firebird2.1 2.1.5~svn+54537.ds2-1Dependencies installation failed Log
flexml 1.9.2-1Undetected errorLog
fracplanet 0.4.0-3Undetected errorLog
freecell-solver 3.4.0-1Dependencies installation failed Log
fsvs 1.2.3-0+nmu1configure: error: You have a sparse S_IFMT. Please tell the dev@ mailing list. Log
fvwm 1:2.5.30.ds-1.1configure: error: " Log
fwbuilder 5.1.0-3CompilerDriver_ipt_run.cpp:655:16: error: invalid operands to binary expression ('QTextStream' and '') Log
g15daemon-audacious 2.5.7-4configure: error: Cannot find glib2/gtk2/pango Log
gap 4r4p12-2Undetected errorLog
gauche 0.9.1-5Dependencies installation failed Log
gauche-c-wrapper 0.6.1-4.1clang: error: unable to execute command: Broken pipe Log
gauche-gtk 0.4.1-13configure.in:10: error: possibly undefined macro: AC_GAUCHE_INIT_EXT Log
gbsplay 0.0.91-1Undetected errorLog
gcc-3.3 1:3.3.6ds1-25 Log
gcc-h8300-hms 1:3.4.6-7Undetected errorLog
gcc-m68hc1x 1:3.3.6+3.1+dfsg-3Undetected errorLog
gcc-msp430 4.6.3~mspgcc-20120406-3 Log
gcj-4.6 4.6.3-2 Log
gcj-4.7 4.7.1-1 Log
gdb-avr 7.2-1 Log
gdb-msp430 7.2a~mspgcc-20111205-1 Log
gerris 20110329-dfsg.2-1configure: error: Log
gesftpserver 0.1-3Undetected errorLog
gforth 0.7.0+ds1-6make[1]: emacs: Command not found Log
giftrans 1.12.2-16Undetected errorLog
gimp-dimage-color 1.1.0-3gimpmatrix.h:23:2: error: "Only can be included directly." Log
git 1:1.7.10.4-1error: invalid object 100644 1000000000000000000000000000000000000000 for 'dir/file1' Log
glibmm2.4 2.32.0-1Undetected errorLog
gmerlin 1.2.0~dfsg-2bgyadif.c:769:9: error: ambiguous instructions require an explicit suffix (could be 'cmpb', 'cmpw', 'cmpl', or 'cmpq') Log
gmp 2:5.0.5+dfsg-2tmp-mod_1_4.s:167:7: error: ambiguous instructions require an explicit suffix (could be 'subb', 'subw', 'subl', or 'subq') Log
gnat-4.4 4.4.6-6unsatisfiable build-dependency: gcc-4.4-source (< 4.4.7) but 4.4.7-1 is to be installed Log
gnome-scan 0.6.2-1.1unsatisfiable build-dependency: libgegl-0.0-dev (>= 0.0.21) (versioned dep on a virtual pkg?) Log
gnucap 1:0.36~20091207-2./mg_.h:134:19: error: variable has incomplete type 'C_Comment' Log
gnustep-base 1.22.1-2configure: error: Could not find Objective-C headers Log
gonzui 1.2+cvs20070129-3make[1]: *** No targets specified and no makefile found. Stop. Log
google-glog 0.3.2-3Undetected errorLog
goplay 0.5-1.1engine.h:153:24: error: calling a protected constructor of class 'wibble::commandline::OptionGroup' Log 753645
gprolog 1.3.0-6.1Undetected errorLog
gpsd 3.6-4 Log
granule 1.4.0-7-1Granule.cpp:59:1: error: extraneous 'template<>' in declaration of variable 'm_default_entity_loader' Log
groff 1.21-7Dependencies installation failed Log
grub 0.97-66configure: error: GRUB requires GAS .code16 addr32 support; upgrade your binutils Log
guile-1.6 1.6.8-10.1Undetected errorLog
guile-1.8 1.8.8+1-8Undetected errorLog
guile-2.0 2.0.5+1-3Undetected errorLog
guppy 0.1.9-2ImportError: guppy/sets/setsc.so: undefined symbol: _PyLong_AsScaledDouble Log
guymager 0.6.7-3aewf.cpp:126:12: error: field has incomplete type 'uint []' Log
hardening-wrapper 2.2Undetected errorLog
haskell-hledger-web 0.18.1-1Undetected errorLog
hiredis 0.10.1-7hiredis.c:799:31: error: second argument to 'va_arg' is of incomplete type 'void' Log
hpodder 1.1.5.0+nmu3unsatisfiable build-dependency: libghc-haxml-dev (< 1:1.21~) but 1:1.22.5-2+b2 is to be installed Log
hsqldb 1.8.0.10-12Dependencies installation failed Log
htp 1.16-3snprintf.c:856:2: error: array type 'va_list' (aka '__builtin_va_list') is not assignable Log
hugs98 98.200609.21-5.3tools/make_bootlib: 68: tools/make_bootlib: -D__HUGS__: not found Log
hwinfo 16.0-2.2./AsmMacros.h:366:24: error: invalid operand in inline asm: 'in${0:B} ($1)' Log
hylafax 3:6.0.6-1Undetected errorLog
ibus-qt 1.3.1-2.1qibusserializable.h:94:59: error: non-const lvalue reference to type 'QVariant' cannot bind to a temporary of type 'QVariant' Log
iceape 2.7.5-1../../../../mozilla/js/src/jsapi.h:1748:1: error: 'JS_GetNaNValue' has C-linkage specified, but returns user-defined type 'jsval' (aka 'JS::Value') which is incompatible with C [-Werror,-Wreturn-type-c-linkage] Log
icedove 10.0.4-1./jsapi.h:1748:1: error: 'JS_GetNaNValue' has C-linkage specified, but returns user-defined type 'jsval' (aka 'JS::Value') which is incompatible with C [-Werror,-Wreturn-type-c-linkage] Log
iceweasel 10.0.5esr-1../../../js/src/jsapi.h:1748:1: error: 'JS_GetNaNValue' has C-linkage specified, but returns user-defined type 'jsval' (aka 'JS::Value') which is incompatible with C [-Werror,-Wreturn-type-c-linkage] Log
icewm 1.3.7-4../../src/apppstatus.cc:85:5: error: cannot delete expression of type 'YColor *[3]' Log
icoutils 0.29.1-4Dependencies installation failed Log
imvirt 0.9.4-2vmware.c:67:5: error: invalid operand for instruction Log
inspircd 2.0.5-1Undetected errorLog
ipsec-tools 1:0.8.0-12configure: error: OpenLDAP version must be 2.0 or higher. Aborting. Log
iptux 0.5.3-1AnalogFS.cpp:160:23: error: assigning to 'struct entry *' from incompatible type 'struct entry *' Log
isomd5sum 1:1.0.7+git.20110618.6c9cd2f-1md5.c:160:24: error: argument to 'sizeof' in 'memset' call is the same expression as the destination; did you mean to dereference it? [-Werror,-Wsizeof-pointer-memaccess] Log
italc 1:1.0.13-1.3configure: error: *** Couldn't find any Qt4 libraries Log
jblas 1.2.0-3Undetected errorLog
jovie 4:4.8.4-2componentfactory.h:84:62: error: calling a private constructor of class 'QString' Log
jscoverage 0.5.1-2configure: error: ./configure.gnu failed for js Log
k3d 0.8.0.2-18image_view_factory.hpp:151:43: error: invalid use of incomplete type 'boost::gil::default_color_converter' Log
kaya 0.4.4-5dpkg-buildpackage: error: dpkg-source -b kaya-0.4.4 gave error exit status 2 Log
kbibtex 0.4-2Undetected errorLog 753270
kdeaccessibility 4:4.7.4-2componentfactory.h:84:62: error: calling a private constructor of class 'QString' Log
kdiff3 0.9.96-4Undetected errorLog
keepassx 0.4.3-2Undetected errorLog
kicad 0.20120526+bzr3261-1clone_allocator.hpp:34:22: error: allocating an object of abstract class type 'LIB_ITEM' Log
kmetronome 0.10.1-1Undetected errorLog
kmouth 4:4.8.4-3componentfactory.h:84:62: error: calling a private constructor of class 'QString' Log
kphotoalbum 4.2-1componentfactory.h:84:62: error: calling a private constructor of class 'QString' Log
kplayer 1:0.7-2.1kplayernode.cpp:2401:5: error: unexpected ':' in nested name specifier Log
krusader 1:2.4.0~beta1+git76+de1ea35-1.1checksumdlg.cpp:53:91: error: default arguments can only be specified for parameters in a function declaration Log
lastfm 1:1.5.4.27091+dfsg1-1Undetected errorLog
lcgdm 1.8.2-1Undetected errorLog
le 1.14.3-1configure: error: cannot make curses work Log
libalog 0.4.1-2Undetected errorLog
libb-hooks-parser-perl 0.11-1Undetected errorLog
libcmis 0.1.0-1cmis-client.cxx:137:13: error: delete called on 'libcmis::Session' that is abstract but has non-virtual destructor [-Werror,-Wdelete-non-virtual-dtor] Log
libcrypto++ 5.6.1-6gcm.cpp:746:3: error: unexpected token after + Log
libdebian-installer 0.81../../../include/debian-installer/mem_chunk.h:33:93: error: 'nonnull' attribute applied to function with no pointer arguments [-Werror] Log
libdevice-cdio-perl 0.2.4-5Dependencies installation failed Log
libextractor 1:0.6.3-4dh_install: libextractor3 missing files (usr/lib/*/libextractor/libextractor_pdf.so), aborting Log
libfam-ruby 0.2.0-2Undetected errorLog
libgsl-ruby 1.14.3-1Undetected errorLog
libguestfs 1:1.18.1-1../../../src/launch.c:485:3: error: unknown flag Log
libimlib2-ruby 0.5.2-2Undetected errorLog
libimobiledevice 1.1.1-4ld: .libs/libimobiledevice.so.2.0.1: hidden symbol `debug_buffer' isn't defined Log
libiptcdata 1.0.4-2Undetected errorLog
libitpp 4.2-4Undetected errorLog
libjavascript-perl 1.16-3Dependencies installation failed Log
libjdic-java 0.9.5-7Undetected errorLog
liblastfm 0.4.0~git20090710-1make[1]: *** No rule to make target `headers'. Stop. Log
libmusicbrainz-discid-perl 0.03-1Undetected errorLog
libnih 1.0.3-4...with invalid option after command Log
liboil 0.3.17-2wavelet.c:1759:27: error: invalid use of a cast in a inline asm context requiring an l-value: remove the cast or build with -fheinous-gnu-extensions Log
libpam-pwdfile 0.99-4Dependencies installation failed Log
libphash 0.9.4-1.2CImg.h:27246:18: error: declaration of 't' shadows template parameter Log
libqt4pas 2.5-6Undetected errorLog
libseccomp 0.1.0-1dpkg-buildpackage: error: dpkg-source -b libseccomp-0.1.0 gave error exit status 2 Log
libsyncml 0.5.4-2dh_install: missing files, aborting Log
libtext-hunspell-perl 2.03-1Undetected errorLog
libunistring 0.9.3-5Undetected errorLog
libvigraimpex 1.7.1+dfsg1-3rf_split.hxx:156:26: error: variable has incomplete type 'vigra::CompileTimeError' Log
libvirt 0.9.12-3Undetected errorLog
libwpg 0.2.1-1WPG2Parser.cpp:787:51: error: operator '?:' has lower precedence than '-'; '-' will be evaluated first [-Werror,-Wparentheses] Log
libwx-perl 1:0.9909-1Undetected errorLog
libwx-scintilla-perl 0.38-1Undetected errorLog
libzoom-ruby 0.4.1-2make: /usr/bin/ruby1.8: Command not found Log
lightspark 0.6.0.1-2Undetected errorLog
lilo-installer 1.36Dependencies installation failed Log
lilypond 2.14.2-3Undetected errorLog
linbox 1.1.6~rc0-4.2Undetected errorLog
linux-tools 3.2.7-2Undetected errorLog
logrotate 3.8.1-4Undetected errorLog
lordsawar 0.2.0-2.1armyproto.cpp:39:34: error: array initializer must be an initializer list Log
lowpan-tools 0.2.2-2.1coordinator.c:307:32: error: format specifies type 'unsigned char' but the argument has type 'int' [-Werror,-Wformat] Log
ltrace 0.5.3-2.1ld: warning: cannot find entry symbol _start; defaulting to 0000000000400180 Log
mcl 1:12-068-1matrix.c:1847:1: error: parameter name omitted Log
megaglest 3.6.0.3-1.1Undetected errorLog
memtest86 4.0s-1main.c:102:2: error: indirect goto in function with no address-of-label expressions Log
memtest86+ 4.20-1.1main.c:118:2: error: indirect goto in function with no address-of-label expressions Log
mercurial 2.2.2-1 Log
mesa 8.0.3-1nouveau_array.c:49:16: error: illegal storage class on function Log
mingw32 4.2.1.dfsg-2Undetected errorLog
mingw32-binutils 2.20-0.2 Log
miredo 1.2.3-1Undetected errorLog
mknbi 1.4.4-9Undetected errorLog
mlt 0.8.0-1./vf_yadif_template.h:228:9: error: ambiguous instructions require an explicit suffix (could be 'cmpb', 'cmpw', 'cmpl', or 'cmpq') Log
mongodb 1:2.0.6-1Undetected errorLog
monotone 1.0-6Undetected errorLog
mpich2 1.4.1-4configure: error: Cannot build shared libraries with this compiler Log
mrpt 1:0.9.6-1math_frwds.h:154:157: error: calling 'lightFromPose' with incomplete return type 'mrpt::math::TPoint2D' Log
muse 2.0~rc2-2Undetected errorLog
nagircbot 0.0.33-1Dependencies installation failed Log
ncbi-blast+ 2.2.26-3objhook.hpp:626:34: error: cannot catch reference to incomplete type 'ncbi::CEofException' Log
netams 3.4.5-2.1./netflow.h:242:27: error: 'long type-name' is invalid Log
netsed 1.00b-2Undetected errorLog
netsurf 2.9-2Undetected errorLog
nget 0.27.1-11configure: error: recv unable to find a working combination Log
nn 6.7.3-3.1make[2]: *** No rule to make target ` articles.h', needed by `nn.o'. Stop. Log
node-expat 1.5.0-2Dependencies installation failed Log
node-postgres 0.7.0-1Dependencies installation failed Log
nodejs 0.6.19~dfsg1-2Undetected errorLog
nordugrid-arc 2.0.0-2../../../../include/arc/client/../../../src/hed/libs/client/EntityRetriever.h:23:1: error: template specialization requires 'template<>' Log
npapi-vlc 2.0.0-1./control/nporuntime.h:226:13: error: static declaration of 'RuntimeNPClassGetProperty' follows non-static declaration Log
obby 0.4.8-1../inc/zeroconf_avahi.hpp:135:40: error: assigning to 'AvahiWatchEvent' from incompatible type 'int' Log
obdgpslogger 0.16-1.1gpscomm.c:29:45: error: too few arguments to function call, expected 3, have 2 Log
obnam 1.1-1Undetected errorLog
ocaml-cry 0.2.2-1configure: error: configure script must not be run with root user! Log
ocaml-duppy 0.4.2-1configure: error: configure script must not be run with root user! Log
ocaml-gstreamer 0.1.0-3configure: error: configure script must not be run with root user! Log
ocaml-ladspa 0.1.4-1configure: error: configure script must not be run with root user! Log
ocaml-lame 0.3.1-1configure: error: configure script must not be run with root user! Log
ocaml-mad 0.4.4-1configure: error: configure script must not be run with root user! Log
ocaml-mm 0.2.0-1configure: error: configure script must not be run with root user! Log
ocaml-ogg 0.4.3-1configure: error: configure script must not be run with root user! Log
ocaml-soundtouch 0.1.7-1configure: error: configure script must not be run with root user! Log
ocaml-vorbis 0.6.1-1configure: error: configure script must not be run with root user! Log
ocropus 0.3.1-4configure: error: Could not find tesseract! Choose --without-tesseract if you do not want to use it. Log
octave 3.6.2-1../liboctave/eigs-base.cc:3837:1: error: explicit instantiation cannot have a storage class Log
open-cobol 1.1-1Undetected errorLog
opencity 0.0.6.4stable-1.1../../src/destination.h:25:6: error: redeclaration of already-defined enum 'OPENCITY_DIRECTION' is a GNU extension [-Werror,-pedantic,-Wgnu] Log
openmcu 2.2.5-1 Log
openvpn-auth-ldap 2.0.3-3configure: error: Can't locate Objective C runtime headers Log
otcl 1.14+dfsg-2tclInt.h:54:13: error: typedef redefinition with different types ('int' vs 'typeof (((int *)0) - ((int *)0))' (aka 'long')) Log
oxref 0.90.10-1./oxref.cc:7:9: error: initialization of non-aggregate type 'Arg::LongOption' (aka 'FBB::LongOption__') with an initializer list Log
pathfinder 1.1.3-0.4wvscatterhash.h:186:46: error: invalid use of non-static data member 'xstatus' Log
pcp 3.6.4access.o: r .L.str : Error: additional symbol Log
pdftk 1.44-5PdfStream.java:242: error: PdfEncryption cannot be resolved to a type Log
pearpc 0.5.dfsg-2jitc_mmu.S:106:6: error: unknown token in expression Log
pgsql-asn1oid 0.0.20100818-1make[1]: *** No rule to make target `/usr/lib/postgresql/9.1/lib/pgxs/src/makefiles/pgxs.mk'. Stop. Log
php-suhosin 0.9.33-3Undetected errorLog
php5 5.4.4-2Undetected errorLog
pingus 0.7.6-1.1src/lisp/getters.hpp:33:15: error: no viable conversion from 'std::shared_ptr' to 'const lisp::Lisp *' Log
plucker 1.8-33Dependencies installation failed Log
polybori 0.5~rc1-2.2polybori/include/CDDManager.h:281:28: error: 'mutable' cannot be applied to references Log
posixlock 0.0.1-1.1make: /usr/bin/ruby1.8: Command not found Log
postgresql-8.4 8.4.12-2configure: error: thread test program failed Log
postgresql-9.1 9.1.4-2configure: error: thread test program failed Log
python-cpl 0.3.5.1-1Undetected errorLog
python-enable 4.1.0-1clang: error: no input files Log
python-event 0.3+svn60-3Undetected errorLog
pywavelets 0.2.0-5ImportError: /«PKGBUILDDIR»/build/lib.linux-x86_64-2.7/pywt/_pywt.so: undefined symbol: float_swt_ Log
pyxine 0.1alpha2-7pyxine/libxine_wrap.c:3141:2: error: invalid preprocessing directive Log
qdbm 1.8.78-2./xadbm.h:75:19: error: out-of-line declaration of a member must be a definition [-Wout-of-line-declaration] Log
qgis 1.7.4+1.7.5~20120320-1.1Tools.h:418:35: error: no function named 'operator<<' with type 'std::ostream &(std::ostream &, const Tools::PropertySet &)' was found in the specified scope Log
quisk 3.6.2-1quisk.c:1439:4: error: cannot compile this complex compound assignment yet Log
qxmlrpc 0.0.svn6-2Undetected errorLog
r-cran-pscl 1.03.10-1Undetected errorLog
r-cran-xml 3.9-4-1Undetected errorLog
radare2-bindings 0.9-1/usr/bin/valabind-cc: 1: /usr/bin/valabind-cc: php-config: not found Log
rcov 1.0-1Undetected errorLog
reprepro 4.12.2-1sourceextraction.c:133:2: error: illegal storage class on function Log
rheolef 6.1-2iorheo.cc:192:16: error: explicit instantiation of 'rheolef::iorheobase_memory_handler' must occur in namespace 'rheolef' Log
rhmessaging 0.16-1Undetected errorLog
rtmidi 1.0.15~ds0-2RtMidi.cpp:2488:15: error: 'long long type-name' is invalid Log
ruby-libxml 2.3.2-1Undetected errorLog
ruby-nora 1:0.0.20041021-5/bin/sh: 2: ruby1.8: not found Log
ruby-prof 0.7.3-1Undetected errorLog
rubyluabridge 0.7.0-1Undetected errorLog
saga 2.0.8+dfsg-3table.cpp:128:17: error: taking the address of a temporary object of type 'CSG_Table' [-Waddress-of-temporary] Log
samhain 2.8.3a-1./src/sh_tiger1_64.c:375:3: error: ran out of registers during register allocation Log
sbnc 1.2-25./../Object.h:163:14: error: 'CUser' is an incomplete type Log
scid 1:4.3.0.cvs20120311-1chrono:240:10: error: cannot cast from lvalue of type 'const long' to rvalue reference type 'rep' (aka 'long &&'); types are not compatible Log
scim-chewing 0.3.4-1.1scim_color_button.cpp:71:17: error: variable has incomplete type 'void' Log
ser 2.0.0-5 Log
setools 3.3.7-2qpol_wrap.c:3127:24: error: static declaration of 'qpol_module_get_path' follows non-static declaration Log
simgrid 3.7.1-1Undetected errorLog
sivp 0.5.3-3Dependencies installation failed Log
sks-ecc 0.93-2tfm/mpi.c:2565:15: error: unknown register name '%cc' in asm Log
slang-slirp 1.9.8-1.1configure: error: unable to find the slang library and header file slang.h Log
socat 1.7.1.3-1.4./xio.h:356:4: error: "unexpected size of off_t, please report this as bug" Log
stalin 0.11-5Undetected errorLog
stress 1.0.1-1stress.c:466:5: error: ignoring return value of function declared with const attribute [-Werror,-Wunused-value] Log
styx 1.8.0-1.1sysbase1.c:524:50: error: invalid token at start of a preprocessor expression Log
subtitlecomposer 0.5.3-3scripting_subtitle.cpp:68:13: error: calling a private constructor of class 'SubtitleComposer::Scripting::SubtitleLine' Log
subtle 0.11.3224-xi-1src/subtle/panel.c:265:41: error: initializer overrides prior initialization of this subobject [-Werror,-Winitializer-overrides] Log
subversion 1.7.5-1Undetected errorLog
subvertpy 0.8.10-2Undetected errorLog
supercollider 1:3.5.2-1Undetected errorLog
syncmaildir 1.2.5-1Undetected errorLog
tabix 0.2.5-3Dependencies installation failed Log
tar 1.26-4configure: error: you should not run configure as root (set FORCE_UNSAFE_CONFIGURE=1 in environment to bypass this check) Log
tcc 0.9.26~git20120612.ad5f375-3libtcc1.c:673:45: error: too few arguments provided to function-like macro invocation Log
tclex 1.2a1-15tclInt.h:54:13: error: typedef redefinition with different types ('int' vs 'typeof (((int *)0) - ((int *)0))' (aka 'long')) Log
tcpreplay 3.4.3-2configure: error: Unable to find matching library for header file in /usr Log
texstudio 2.3+debian-3Undetected errorLog
therion 5.3.9-2Dependencies installation failed Log
tk707 0.7.21-9.1configure: error: Sufficiently new version of libasound not found. Log
tkrat 1:2.2cvs20100105-true-dfsg-5Undetected errorLog
totd 1.5.1-1.1Dependencies installation failed Log
tpb 0.6.4-8Undetected errorLog
trafficserver 3.0.5-1configure: error: Need at least one SSL library, --with-openssl is supported Log
traverso 0.49.2-5Tsar.h:66:9: error: field has incomplete type 'void *[]' Log
treil 1.8-1Undetected errorLog
triggerhappy 0.3.4-2make[1]: *** No rule to make target `evtable_EV.h', needed by `eventnames.o'. Stop. Log
troffcvt 1.04-21Undetected errorLog
tudu 0.8.1-1Undetected errorLog
unicap 0.9.5-1.3Dependencies installation failed Log
user-mode-linux 3.2-1um-1include/linux/rcupdate.h:808:2: error: array size is negative Log
vdr-plugin-xineliboutput 1.0.7+cvs20120609.1902-1make[2]: *** No rule to make target `dbus/dbus-glib.h', needed by `tools/gnome_screensaver.o'. Stop. Log
vidalia 0.2.17-1Dependencies installation failed Log
vim 2:7.3.547-1Dependencies installation failed Log
wavpack 4.60.1-3extra2.c:85:41: error: passing 'int' to parameter of incompatible type '__attribute__((__vector_size__(1 * sizeof(long long)))) long long' Log
wcd 5.2.1-2Undetected errorLog
weborf 0.13-2Dependencies installation failed Log
wesnoth-1.10 1:1.10.3-1Undetected errorLog
wmbubble 1.46-3clang: error: language not recognized: '11-2.0' Log
wvdial 1.61-4.1uniconfgen.h:323:19: error: no class named 'Iter' in 'UniConfGen' Log
wvstreams 4.6.1-4./include/wvscatterhash.h:186:46: error: invalid use of non-static data member 'xstatus' Log
xapian-core 1.2.12-1Undetected errorLog
xbmc 2:11.0~git20120510.82388d5-1cpluff.c:80:35: error: too many arguments provided to function-like macro invocation Log
xd 3.22.04-1./arguments.cc:7:9: error: initialization of non-aggregate type 'ArgConfig::LongOption' (aka 'FBB::LongOption__') with an initializer list Log
xdb 1.2.0-7.2dh_install: libxdb1 missing files (debian/tmp/usr/lib/*.so.*), aborting Log
xdotool 1:2.20110530.1-3Undetected errorLog
xen 4.1.3~rc1+hg-20120614.a9c0a89c08f2-4Undetected errorLog
xen-api 1.3.2-6x86_64.h:201:47: error: 'aligned' attribute ignored when parsing type Log
xine-lib 1.1.21-1configure: error: Pthread support is needed Log
xine-lib-1.2 1.2.2-4configure: error: Pthread support is needed Log
xmpi 2.2.3b8-13configure: error: cannot continue -- cannot find Trillium header files Log
xorp 1.8.5-1.1Undetected errorLog
xoscope 2.0-3.2Errors while processing: libcomedi0 libcomedi-dev sbuild-build-depends-xoscope-dummy Log
xsd 3.3.0.1-1.3static-ptr.hxx:63:28: error: cannot allocate function type 'Cult::MM::KeyList ()' with new Log
yade 0.80.1-1debian/build/include/yade/lib/base/Math.hpp:333:5: error: taking the address of a temporary object of type 'const nvp' [-Waddress-of-temporary] Log
yorick-av 0.0.1-2Undetected errorLog
zeitgeist 0.9.0.1-1controller.cpp:131:19: error: cannot cast from type 'gboolean (ZeitgeistFTS::Controller::*)()' to pointer type 'GSourceFunc' (aka 'gboolean (*)(gpointer)') Log
zfsutils 9.0-2Dependencies installation failed Log
zlib 1:1.2.7.dfsg-12Dependencies installation failed Log
ztex-bmp 20110912-1Undetected errorLog
zvbi 0.2.33-6./misc.h:56:5: error: invalid token at start of a preprocessor expression Log
364 errors
Return to the list