Debian Package rebuild

Rebuild of the Debian archive with clang

"Not categorized" build failure(s)
clang 3.3
Return to the list

Versions: 2.9 - 3.0 - 3.1 - 3.2 - 3.3 - 3.4 - 3.4.2 - 3.5.0 - 3.6.0 - 3.8.1
PackageVersionSupposed error messageFull log Bug report
0ad 0.0.13-2Undetected errorLog
389-dsgw 1.1.9-1../doauth.c:30:5: error: third parameter of 'main' (environment) must be of type 'char **' Log
9base 1:6-6n1.c:124:5: error: unterminated function-like macro invocation Log
acct 6.5.5-1Undetected errorLog
aconnectgui 0.9.0rc2-1-9configure: error: Sufficiently new version of libasound not found. Log 684508
acpid 1:2.0.19-1configure: error: "asprintf() not found" Log
activiz.net 1:1.0~git20111214-2stddef.h:29:42: error: missing binary operator before token "(" Log
adabrowse 4.0.3-5Undetected errorLog
adacontrol 1.12r4-3Undetected errorLog
adasockets 1.8.10-2Undetected errorLog
advancecomp 1.17-1Undetected errorLog
aegis 4.24.3-3Undetected errorLog
aeskulap 0.2.2b1-11./poolinstance.h:53:25: error: no function named 'remove_instance' with type 'void (const Glib::RefPtr &)' was found in the specified scope Log
afnix 2.2.0-2Undetected errorLog
agave 0.4.7-2.1refptr.h:208:16: error: member access into incomplete type 'gcs::PaletteTreeModel' Log
alglib 3.7.0-7Undetected errorLog
anet 0.1-3Undetected errorLog
aplus-fsf 4.22.1-6../MSTypes/MSFloatMatrix.H:30:1: error: template specialization requires 'template<>' Log
apq-postgresql 3.2.0-2Undetected errorLog
apron 0.9.10-5.2ppl_user.cc:323:41: error: invalid operands to binary expression ('Parma_Polyhedra_Library::Variable' and 'mpq_class' (aka '__gmp_expr')) Log
apt 0.9.9.1Undetected errorLog
aqemu 0.8.2-2VM.cpp:4566:75: error: reference to type 'const QString' could not bind to an rvalue of type 'bool' Log
aria2 1.17.0-1Undetected errorLog
arj 3.10.22-11Undetected errorLog
arpon 2.0-2.1Undetected errorLog
asc 2.5.0.0-1taskcontainer.cpp:95:10: error: right operand to ? is void, but left operand is of type 'int' Log
asis 2010-5Undetected errorLog
aspectc++ 1:1.1+svn20120529-2stddef.h:29: error: unexpected token `(' in conditional Log
atlas 3.8.4-9.1dasum.c:179:5: error: "This kernel requires SSE2" Log
atlas-cpp 0.6.2-4Undetected errorLog
ats-lang-anairiats 0.2.9-1Undetected errorLog
attica 0.4.2-1Undetected errorLog
avifile 1:0.7.48~20090503.ds-14common/avm_output.cpp:20:12: error: qualified reference to 'AvmOutput' is a constructor name rather than a type wherever a constructor can be declared Log
ax25-tools 0.0.10-rc2+cvs20120204-3./rip98d.h:47:12: error: restrict requires a pointer or reference Log
ball 1.4.1+20111206-4global.h:39:38: error: token is not a valid binary operator in a preprocessor subexpression Log 755225
beignet 0.2-2AlignOf.h:90:1: error: 'alignas' attribute cannot be applied to types Log 750380
binutils-h8300-hms 2.16.1-9Undetected errorLog
binutils-z80 3Undetected errorLog
bitcoin 0.8.3-1Undetected errorLog
blackbox 0.70.1-16Undetected errorLog
blacs-mpi 1.1-31collect2: error: ld returned 1 exit status Log
blas 1.2.20110419-5Undetected errorLog
blktap 2.0.90-2libvhd.c:1073:2: error: indirection of non-volatile null pointer will be deleted, not trap [-Werror,-Wnull-dereference] Log
blobby 1.0~rc3-3RakPeer.cpp:1063:3: error: cannot delete expression of type 'char [16]' Log
boinc 7.1.21+dfsg-1configure: error: in `/«BUILDDIR»/boinc-7.1.21+dfsg' Log
boinc-app-seti 7.00~svn1883-1Dependencies installation failed Log
bomberclone 0.11.9-4../include/gfx.h:108:20: error: inline function 'gfx_blitupdaterectclear' is not defined [-Werror,-Wundefined-inline] Log
botan1.10 1.10.5-1Undetected errorLog
bsnes 0.088-6Dependencies installation failed Log
btag 1.1.3-1Undetected errorLog
busybox 1:1.20.0-8.1findutils/find.c:904:2: error: illegal storage class on function Log
cbmc 4.4-2c_typecheck_type.cpp:472:21: error: function 'alignment_type' is not needed and will not be emitted [-Werror,-Wunneeded-internal-declaration] Log
cegui-mk2 0.7.6-2../../cegui/include/CEGUIWindowFactoryManager.h:486:9: error: cannot catch reference to incomplete type 'CEGUI::Exception' Log
ceph 0.48-1.1./include/interval_set.h:90:35: error: no class named 'const_iterator' in 'interval_set' Log 749083
cgal 4.2-4Undetected errorLog
cinnamon 1.7.4-2st/st-background-effect.c:240:28: error: invalid suffix 'd' on floating constant Log
clamav 0.97.8+dfsg-1Undetected errorLog
clhep 2.1.3.1-1dh_auto_test: make -j1 check returned exit code 2 Log
clxclient 3.9.0-1Undetected errorLog
cmake 2.8.11.2-1Undetected errorLog
cmdpack 1.03-1src/banner.h:7:2: error: embedding a #include directive within macro arguments is not supported Log
coinor-flopc++ 1.0.6-3.1./MP_domain.hpp:180:18: error: return type of virtual function 'getSet' is not covariant with the return type of the function it overrides ('flopc::MP_set_base' is incomplete) Log
compiz 0.8.4-5.2decorator.cpp:211:24: error: allocating an object of abstract class type 'KWD::Window' Log
condor 7.8.2~dfsg.1-1+deb7u1HashTable.h:264:23: error: invalid operands to binary expression ('ThreadInfo' and 'const ThreadInfo') Log
cone 0.89-1Undetected errorLog
cook 2.33-1Undetected errorLog
coriander 2.0.2-2configure: error: The XV overlay libraries were not found Log
couriergrey 0.3.2-3Undetected errorLog
cpl 6.2-1configure: error: Building with thread support requires a thread-safe libcfitsio! Please update your cfitsio installation Log
cppcheck 1.60.1-1Undetected errorLog
cpuburn 1.4a-5burnK7.S:83:10: error: unexpected token in '.fill' directive Log
crash 7.0.1-2Undetected errorLog
crtools 0.4-2arch/x86/include/asm/bitops.h:23:15: error: ambiguous instructions require an explicit suffix (could be 'btsw', 'btsl', or 'btsq') Log
cups 1.6.2-10Undetected errorLog
darts 0.32-13Undetected errorLog
db4.8 4.8.30-12libtool.m4: error: problem compiling CXX test program Log
dbusada 0.2-2Undetected errorLog
debconf-kde 0.2-2Undetected errorLog
dehydra 0.9.hg20120525-1Undetected errorLog
dicom3tools 1.00~20130623-2./Imakefile:163:3: error: invalid preprocessing directive Log
din 5.2.1-1main.cc:296:49: error: non-aggregate type 'const color' cannot be initialized with an initializer list Log
dirac 1.0.2-6Undetected errorLog
dmapi 2.2.10-1Undetected errorLog
drawtiming 0.7.1-5Undetected errorLog
drizzle 1:7.1.36-stable-4drizzled/cursor.cc:1334:7: error: unknown flag Log
dvdisaster 0.72.4-1Undetected errorLog
ecasound 2.9.0-1Undetected errorLog
ecl 12.12.1-3unix64.S:357:17: error: invalid variant 'rel' Log
eglibc 2.17-7configure: error: --enable-multi-arch support requires assembler and linker support Log
ergo 3.2.1-1API_test.cc:2441:13: error: static declaration of 'filewrite' follows non-static declaration Log
estic 1.61-20.1./coll.h:317:7: error: invalid operands to binary expression ('Stream' and 'u32' (aka 'unsigned int')) Log
esys-particle 2.2.u1-2./SphAggGougeBlock.hpp:39:37: error: no viable conversion from '__normal_iterator' to '__normal_iterator' Log
etl 0.04.16-1Undetected errorLog
falconpl 0.9.6.9-git20120606-2Undetected errorLog
fatrat 1.1.3-5config.hpp:46:2: error: you must define either BOOST_ASIO_SEPARATE_COMPILATION or BOOST_ASIO_DYN_LINK in your project in order for asio's declarations to be correct. If you're linking dynamically against libtorrent, define BOOST_ASIO_DYN_LINK otherwise BOOST_ASIO_SEPARATE_COMPILATION. You can also use pkg-config or boost build, to automatically apply these defines Log
fcitx 1:4.2.7-2Undetected errorLog
fftw3 3.3.3-5openmp.c:26:2: error: OpenMP enabled but not using an OpenMP compiler Log
filezilla 3.7.0.2-1configure: error: tinyxml.h not found. If you do not have TinyXML installed as system library, you can use the copy of TinyXML distributed with FileZilla by passing --with-tinyxml=builtin as argument to configure. Log
firebird2.5 2.5.2.26540.ds4-1Undetected errorLog
fltk1.1 1.1.10-16Undetected errorLog 755228
fox1.6 1.6.45-1Undetected errorLog
freefoam 0.1.0+dfsg-1Pstream.H:518:29: error: no function named 'reduce' with type 'void (scalar &, const sumOp &)' was found in the specified scope Log
freetype 2.4.9-1.1ttload.c:550:9: error: using extended field designator is an extension [-Werror,-Wextended-offsetof] Log
fsvs 1.2.5-1configure: error: in `/«PKGBUILDDIR»' Log
fvwm 1:2.6.5.ds-2configure: error: " Log
gap 4r4p12-2Undetected errorLog
gbsplay 0.0.91-1Undetected errorLog
gcc-3.3 1:3.3.6ds1-25Undetected errorLog
gcc-4.4 4.4.7-4Undetected errorLog
gcc-4.6 4.6.4-4Undetected errorLog
gcc-4.7 4.7.3-5Undetected errorLog
gcc-4.8 4.8.1-6Undetected errorLog
gcc-avr 1:4.7.2-2Undetected errorLog
gcc-mingw-w64 8./genfixes: 1: ./genfixes: autogen: not found Log
gcc-snapshot 20130620-1Undetected errorLog
gcompris 12.01-1rsvg-cairo.h:27:2: error: "Including directly is deprecated." [-Werror,-W#warnings] Log
gdb 7.6-5Undetected errorLog
gdb-msp430 7.2a~mspgcc-20111205-2Undetected errorLog
gdc-4.4 1.063-4.4.7-1Undetected errorLog
gdcm 2.2.3-2stddef.h:29:42: error: missing binary operator before token "(" Log
gecko-mediaplayer 1.0.8-4plugin.cpp:64:58: error: invalid suffix on literal; C++11 requires a space between literal and identifier [-Wreserved-user-defined-literal] Log
gecode 4.0.0-2Undetected errorLog
geda-gaf 1:1.8.1-3Undetected errorLog
gegl 0.2.0-3Undetected errorLog
gem 1:0.93.3-5Undetected errorLog
gengetopt 2.22.6-2Undetected errorLog
genparse 0.9.1-1Undetected errorLog
gforth 0.7.0+ds2-0.1make[1]: emacs: Command not found Log
ghc 7.6.3-3configure: error: Building ghc-pwd failed Log
giftrans 1.12.2-17Undetected errorLog
glibmm2.4 2.36.2-1Undetected errorLog
gltron 0.70final-10vector.c:244:2: error: passing 'const char [83]' to parameter of type 'char *' discards qualifiers [-Werror,-Wincompatible-pointer-types-discards-qualifiers] Log
gmerlin 1.2.0~dfsg+1-1bgyadif.c:769:9: error: ambiguous instructions require an explicit suffix (could be 'cmpb', 'cmpw', 'cmpl', or 'cmpq') Log
gmp 2:5.1.2+dfsg-2tmp-mod_1_1.s:125:2: error: ambiguous instructions require an explicit suffix (could be 'subb', 'subw', 'subl', or 'subq') Log
gnade 1.6.2-9Undetected errorLog
gnash 0.8.11~git20120629-1agg_scanline_u.h:476:30: error: type 'base_type' (aka 'agg::scanline_u8') is not a direct or virtual base of 'scanline32_u8_am' Log
gnat-gps 5.0-14Undetected errorLog
gnote 3.8.1-2Undetected errorLog
gnucap 1:0.36~20091207-2./mg_.h:134:19: error: variable has incomplete type 'C_Comment' Log
gnudatalanguage 0.9.3-2Undetected errorLog
gnustep-base 1.22.1-4.1configure: error: Could not find Objective-C headers Log
google-glog 0.3.3-1Undetected errorLog
google-perftools 2.0-4src/base/linuxthreads.cc:312:22: error: assigning to 'void (*)(int, struct siginfo *, void *)' from incompatible type 'void (int, siginfo_t *, void *)': type mismatch at 2nd parameter ('struct siginfo *' vs 'siginfo_t *') Log
gprbuild 2011-3Undetected errorLog
gprolog 1.3.0-6.1Undetected errorLog
grantlee 0.3.0-5Undetected errorLog
graphite2 1.2.3-1Undetected errorLog
grcompiler 4.2-1Undetected errorLog
grive 0.2.0-1Undetected errorLog
groff 1.22.2-3Undetected errorLog
grub 0.97-67configure: error: GRUB requires GAS .code16 addr32 support; upgrade your binutils Log
grub2 2.00-14configure: error: gcc-4.7 failed to produce assembly code Log
gsoap 2.8.12-1Undetected errorLog
gxine 0.5.907-2gmessages.h:31:2: error: "Only can be included directly." Log
hardening-wrapper 2.3dh_auto_test: make -j1 check returned exit code 2 Log
haskell-hledger-web 0.20-2Undetected errorLog
haskell-hsp 0.8.0-2Dependencies installation failed Log
htmlcxx 0.85-2Undetected errorLog
hugs98 98.200609.21-5.3tools/make_bootlib: 68: tools/make_bootlib: -D__HUGS__: not found Log
hwinfo 16.0-2.2./AsmMacros.h:366:24: error: invalid operand in inline asm: 'in${0:B} ($1)' Log
hylafax 3:6.0.6-5Undetected errorLog
ibus-qt 1.3.1-2.1qibusserializable.h:94:59: error: non-const lvalue reference to type 'QVariant' cannot bind to a temporary of type 'QVariant' Log
iceape 2.7.12-1../../../../mozilla/js/src/jsapi.h:1761:1: error: 'JS_GetNaNValue' has C-linkage specified, but returns user-defined type 'jsval' (aka 'JS::Value') which is incompatible with C [-Werror,-Wreturn-type-c-linkage] Log
icecc 1.0.0-1dh_install: missing files, aborting Log
icedove 17.0.7-1jsinterp.cpp:3684:9: error: indirect goto might cross protected scopes Log
iceweasel 17.0.7esr-1jsinterp.cpp:3684:9: error: indirect goto might cross protected scopes Log
icewm 1.3.7-5../../src/apppstatus.cc:85:5: error: cannot delete expression of type 'YColor *[3]' Log
icu 4.8.1.1-12Undetected errorLog
idjc 0.8.7-2configure: error: "math library is missing critical function" Log
imvirt 0.9.5-3vmware.c:65:5: error: invalid operand for instruction Log
ipsec-tools 1:0.8.0-14isakmp.c:1137:11: error: promoted type 'int' of K&R function parameter is not compatible with the parameter type 'u_int8_t' (aka 'unsigned char') declared in a previous prototype [-Werror,-Wknr-promoted-parameter] Log
iptux 0.5.3-1AnalogFS.cpp:160:23: error: assigning to 'struct entry *' from incompatible type 'struct entry *' Log
iverilog 0.9.6-1Undetected errorLog
ivtools 1.2.10a1-1Undetected errorLog
jscoverage 0.5.1-2configure: error: No size found for void* Log
jthread 1.3.1-3Undetected errorLog
k3d 0.8.0.2-20image_view_factory.hpp:151:43: error: invalid use of incomplete type 'boost::gil::default_color_converter' Log
kbibtex 0.4-4Undetected errorLog 753270
kde4libs 4:4.10.5-1Undetected errorLog
kicad 0.20120526+bzr3261-1clone_allocator.hpp:34:22: error: allocating an object of abstract class type 'LIB_ITEM' Log
kmetronome 0.10.1-1Undetected errorLog
kplayer 1:0.7-2.1kplayernode.cpp:2401:5: error: unexpected ':' in nested name specifier; did you mean '::'? Log
laserboy 2012.11.11-1LaserBoy_frame_set.hpp:259:38: error: parameter of overloaded 'operator++' cannot have a default argument Log
lbzip2 2.2-2dh_auto_test: make -j1 check returned exit code 2 Log
lcgdm 1.8.6-4Undetected errorLog
lensfun 0.2.7-2lensfun.h:68:13: error: "I don't know how to change symbol visibility for your compiler" Log
leveldb 1.12.0-1Undetected errorLog
libalog 0.4.1-2Undetected errorLog
libao 1.1.0-2configure: error: No 16 bit type found on this platform! Log
libapache2-mod-perl2 2.0.8+httpd24-r1449661-5dh_auto_test: make -j1 test returned exit code 2 Log
libaria 2.7.5.2+repack-2Undetected errorLog
libavg 1.7.1-3../../../src/graphics/GLContext.h:54:38: error: type 'const avg::GLConfig' does not provide a call operator Log
libaws 2.10.2-4Undetected errorLog
libb-hooks-parser-perl 0.12-1dh_auto_test: make -j1 test returned exit code 2 Log
libccaudio2 2.0.5-3friends.cpp:1189:11: error: call to non-static member function without an object argument Log
libcrypto++ 5.6.1-6gcm.cpp:746:3: error: Unexpected token! Log
libdap 3.11.1-15Undetected errorLog
libdbusmenu-qt 0.9.2-1Undetected errorLog
libdc0 0.3.24~svn3121-2Undetected errorLog
libdvbpsi 1.0.0-2descriptors/dr_7c.c:248:76: error: operator '?:' has lower precedence than '-'; '-' will be evaluated first [-Werror,-Wparentheses] Log
libechonest 2.1.0-2Undetected errorLog
libflorist 2011-1Undetected errorLog
libgmpada 0.0.20121109-2Undetected errorLog
libgooglepinyin 0.1.2-1Undetected errorLog
libguestfs 1:1.22.4-1../../../src/launch.c:63:3: error: unknown flag Log
libimobiledevice 1.1.1-4ld: .libs/libimobiledevice.so.2.0.1: hidden symbol `debug_buffer' isn't defined Log
libkdegames 4:4.10.5-1Undetected errorLog
libkdtree++ 0.7.1+git20101123-2kdtree.hpp:1207:28: error: invalid operands to binary expression ('basic_ostream >' and 'const KDTree::_Node_base') Log
libktorrent 1.2.1-1Undetected errorLog
liblastfm 1.0.7-2Undetected errorLog
liblognorm 0.3.6-2Undetected errorLog
libmusicbrainz5 5.0.1-2Undetected errorLog
libncursesada 5.9.20110404-7Undetected errorLog
libofx 1:0.9.4-2.1Undetected errorLog
libogg 1.3.1-1configure: error: No 16 bit type found on this platform! Log
liboil 0.3.17-2wavelet.c:1759:27: error: invalid use of a cast in a inline asm context requiring an l-value: remove the cast or build with -fheinous-gnu-extensions Log
libomxalsa 0.1-2configure: error: POSIX threads support is required Log
libomxcamera 0.1-2configure: error: in `/«PKGBUILDDIR»' Log
libomxfbdevsink 0.1-2configure: error: in `/«PKGBUILDDIR»' Log
libomxil-bellagio 0.9.3-1configure: error: libdl is required Log
libomxmad 0.1-1configure: error: POSIX threads support is required Log
libomxvideosrc 0.1-1configure: error: in `/«PKGBUILDDIR»' Log
libomxvorbis 0.1-3configure: error: in `/«PKGBUILDDIR»' Log
libomxxvideo 0.1-2configure: error: POSIX threads support is required Log
libpgf 6.12.24+ds1-2Undetected errorLog
libphash 0.9.4-1.2CImg.h:27246:18: error: declaration of 't' shadows template parameter Log
libpinyin 0.8.0-2Undetected errorLog
libqt4pas 2.5-10Undetected errorLog
libraw 0.15.3-1Undetected errorLog
libreoffice 1:4.0.4-2Undetected errorLog
libs3 2.0-2inc/request.h:131:14: error: sizeof on pointer operation will return size of 'char *' instead of 'char [9]' [-Werror,-Wsizeof-array-decay] Log
libstoragemgmt 0.0.20-1Undetected errorLog
libtemplates-parser 11.6-2Undetected errorLog
libtext-hunspell-perl 2.05-1dh_auto_test: make -j1 test returned exit code 2 Log
libtexttools 2.1.0-2Undetected errorLog
libunwind 1.1-1dh_auto_test: make -j1 check returned exit code 2 Log
libvirt 1.1.0-2../../../src/util/vireventpoll.c:134:5: error: unknown flag Log
libwpd 0.9.8-1Undetected errorLog
libwx-perl 1:0.9922-1Undetected errorLog
libwx-scintilla-perl 0.38-1Undetected errorLog
libzen 0.4.29-1Undetected errorLog
libzip 0.10.1-1.1dh_auto_test: make -j1 check returned exit code 2 Log
licq 1.7.1-1Undetected errorLog
lierolibre 0.5-1src/gvl/io/encoding.hpp:586:19: error: cast from pointer to smaller type 'uint32_t' (aka 'unsigned int') loses information Log
liggghts 2.3.6-1Undetected errorLog
lightspark 0.7.2-2Undetected errorLog
lilypond 2.16.2-2accidental-engraver.cc:502:1: error: cannot cast from type 'void (Accidental_engraver::*)(Grob_info)' to pointer type 'Engraver_void_function_engraver_grob_info' (aka 'void (*)(Engraver *, Grob_info)') Log
linphone 3.5.2-10sal_eXosip2.c:49:50: error: too few arguments to function call, expected 4, have 3 Log
linux 3.9.8-1Undetected errorLog
linux-latest 49Undetected errorLog
linux-tools 3.9.4-1Undetected errorLog
llvm-toolchain-3.3 1:3.3-3Undetected errorLog
llvm-toolchain-snapshot 1:3.4~svn183914-1Undetected errorLog
lookup 1.08b-11lib/romaji2kana.c:59:12: error: source file is not valid UTF-8 Log
lordsawar 0.2.0-2.1armyproto.cpp:39:34: error: array initializer must be an initializer list Log
ltrace 0.5.3-2.1ld: warning: cannot find entry symbol _start; defaulting to 0000000000400180 Log
ltt-control 2.1.1-2gen-ust-events.c:53:3: error: unknown flag Log
lttv 0.12.38-21032011-1configure: error: Log
luabind 0.9.1+dfsg-5Dependencies installation failed Log
lvtk 1.1.1~dfsg0-1ui_features.hpp:47:45: error: assigning to 'mapped_type' (aka 'void (*)(void *, void *)') from incompatible type 'void (*)(void *, FeatureData *)': type mismatch at 2nd parameter ('void *' vs 'FeatureData *' (aka 'void **')) Log
lzip 1.14-2Undetected errorLog
lziprecover 1.13-4Undetected errorLog
m4 1.4.16-5dh_auto_test: make -j1 check returned exit code 2 Log
mach 0.9.1-3.1mach-helper.c:155:3: error: ignoring return value of function declared with warn_unused_result attribute [-Werror,-Wunused-result] Log
maude 2.6-3Undetected errorLog
megaglest 3.6.0.3-1.2Undetected errorLog
memtest86 4.0s-1main.c:102:2: error: indirect goto in function with no address-of-label expressions Log
memtest86+ 4.20-1.1main.c:118:2: error: indirect goto in function with no address-of-label expressions Log
mercurial-buildpackage 0.10Undetected errorLog
mesa 9.1.4-1Undetected errorLog
mia 2.0.10-1Undetected errorLog
mingw32-binutils 2.20-0.2Undetected errorLog
mira 3.9.17-1clang: error: argument to '-V' is missing (expected 1 value) Log
mknbi 1.4.4-10Undetected errorLog
mongodb 1:2.4.3-1Undetected errorLog
monotone 1.0-8Undetected errorLog
mpfr4 3.1.1-1Undetected errorLog
mpich2 1.4.1-4.2configure: error: Cannot build shared libraries with this compiler Log
mrpt 1:1.0.1-1math_frwds.h:161:157: error: calling 'lightFromPose' with incomplete return type 'mrpt::math::TPoint2D' Log
mysql-5.5 5.5.31+dfsg-1Undetected errorLog
mysql-workbench 5.2.47+dfsg-2./my_sys.h:277:27: error: definition of variable with array type needs an explicit size or an initializer Log
nast 0.2.0-6Undetected errorLog
ncmpcpp 0.5.10-1.1./screen.h:265:3: error: cannot initialize object parameter of type 'NCurses::Window' with an expression of type 'NCurses::Scrollpad' Log
netsurf 2.9-2Undetected errorLog
nget 0.27.1-11./par2/par2fileformat.h:89:25: error: flexible array member 'entries' of non-POD element type 'FILEVERIFICATIONENTRY []' Log
ninja-build 1.3.3-2Undetected errorLog
nn 6.7.3-8make[2]: *** No rule to make target ` articles.h', needed by `nn.o'. Stop. Log
npapi-vlc 2.0.6-1./control/nporuntime.h:225:13: error: static declaration of 'RuntimeNPClassGetProperty' follows non-static declaration Log
ns2 2.35+dfsg-1common/tclAppInit.cc:240:26: error: declaration of 'globalMemTrace' has a different language linkage Log
nss 2:3.15-1intel-gcm.s:29:13: error: unknown token in expression Log
obby 0.4.8-1../inc/zeroconf_avahi.hpp:135:40: error: assigning to 'AvahiWatchEvent' from incompatible type 'int' Log
oce 0.12-3Undetected errorLog
octave 3.6.4-3../liboctave/eigs-base.cc:3837:1: error: explicit instantiation cannot have a storage class Log
octave-nan 2.5.5-2Undetected errorLog
octave-sockets 1.0.8-1Undetected errorLog
open-cobol 1.1-1dh_auto_test: make -j1 check returned exit code 2 Log
opencity 0.0.6.4stable-1.1../../src/destination.h:25:6: error: redeclaration of already-defined enum 'OPENCITY_DIRECTION' is a GNU extension [-Werror,-Wgnu] Log
opencv 2.3.1-11Dependencies installation failed Log
openexr 1.6.1-7Undetected errorLog
openmsx-catapult 0.9.1-1Undetected errorLog
opensaml2 2.4.3-4SAMLConfig.cpp:31:4: error: "Logging library mismatch (XMLTooling is using log4shib)." Log
openssl 1.0.1e-3Undetected errorLog
opentoken 4.0b-3Undetected errorLog
openvpn-auth-ldap 2.0.3-5.1configure: error: Can't locate Objective C runtime headers Log
orafce 3.0.4-1plvlex.c:209:26: error: too many arguments to function call, expected 0, have 1 Log
otcl 1.14+dfsg-2tclInt.h:54:13: error: typedef redefinition with different types ('int' vs 'long') Log
paraview 4.0.1-1Undetected errorLog
pathfinder 1.1.3-0.4wvscatterhash.h:186:46: error: invalid use of non-static data member 'xstatus' Log
pcp 3.8.0access.o: r .L.str : Error: additional symbol Log
phonon 4:4.6.0.0-3Undetected errorLog
php-mongo 1.4.1-1configure: error: in `/«PKGBUILDDIR»' Log
pingus 0.7.6-1.1src/lisp/getters.hpp:33:15: error: no viable conversion from 'std::shared_ptr' to 'const lisp::Lisp *' Log
plzip 0.9-4Undetected errorLog
polkit-qt-1 0.103.0-1Undetected errorLog
polybori 0.5~rc1-2.3polybori/include/CDDManager.h:281:28: error: 'mutable' cannot be applied to references Log
postgres-xc 1.0.3-1configure: error: thread test program failed Log
postgresql-9.1 9.1.9-2configure: error: thread test program failed Log
prime-phylo 1.0.11-1PrimeOptionMap.hh:161:32: error: no function named 'operator<<' with type 'std::ostream &(std::ostream &, const beep::PrimeOptionMap &)' was found in the specified scope Log
prison 1.0+dfsg-1Undetected errorLog
proftmb 1.1.12-1Undetected errorLog
protobuf 2.4.1-3Undetected errorLog
pulseaudio 4.0-3arm_neon.h:28:2: error: "NEON support not enabled" Log
pytango 8.0.3-1device_attribute.cpp:404:5: error: static declaration of '_update_array_values_as_tuples' follows non-static declaration Log
python-cffi 0.6-1Undetected errorLog
python-enable 4.1.0-1clang: error: no input files Log
pywavelets 0.2.0-5Dependencies installation failed Log
pyxine 0.1alpha2-8pyxine/libxine_wrap.c:3141:2: error: invalid preprocessing directive Log
qapt 1.3.0-2Undetected errorLog
qca2 2.0.3-4Undetected errorLog
qdbm 1.8.78-2./xadbm.h:75:19: error: out-of-line declaration of a member must be a definition [-Wout-of-line-declaration] Log
qpdf 4.2.0-2Undetected errorLog
qtkeychain 0.1.0-1Undetected errorLog
quisk 3.6.11-1quisk.c:2199:4: error: cannot compile this complex compound assignment yet Log
rampart 1.3.0-3error.c:91:5: error: implicitly declaring library function 'vsnprintf' with type 'int (char *, unsigned long, const char *, __va_list_tag *)' [-Werror] Log
rapicorn 13.03.0~ds0-1configure: error: detected GNUC version too old Log
realtimebattle 1.0.8-13Undetected errorLog
reprepro 4.13.1-1sourceextraction.c:132:2: error: illegal storage class on function Log
resiprocate 1.8.10-5Undetected errorLog
rheolef 6.4-1iorheo.cc:192:16: error: explicit instantiation of 'rheolef::iorheobase_memory_handler' must occur in namespace 'rheolef' Log
roboptim-core 2.0-4problem.hxx:307:20: error: unused variable 'interval' [-Werror,-Wunused-variable] Log
rocs 4:4.8.4-1dh_auto_test: make -j1 test ARGS+=-j1 returned exit code 2 Log
root-system 5.34.09-1Undetected errorLog
rtmidi 2.0.1~ds0-3RtMidi.cpp:3412:15: error: 'long long type-name' is invalid Log
ruby1.8 1.8.7.358-7.1Undetected errorLog
samhain 2.8.3a-1./src/sh_tiger1_64.c:375:3: error: ran out of registers during register allocation Log
sbnc 1.2-26./../Object.h:163:14: error: 'CUser' is an incomplete type Log
sdcv 0.4.2-17Undetected errorLog
setools 3.3.8-1Undetected errorLog
shiboken 1.1.2-4Undetected errorLog
sigx 2.0.2-1gatomic.h:26:2: error: "Only can be included directly." Log
sikuli 1.0~x~rc3.tesseract3-dfsg1-6Dependencies installation failed Log
sinfo 0.0.46-2bind.hpp:69:22: error: type 'void (*)(int) __attribute__((noreturn))' cannot be used prior to '::' because it has no members Log
sks-ecc 0.93-2tfm/mpi.c:2565:15: error: unknown register name '%cc' in asm Log
smlsharp 1.2.0-1016.s:4714:22: error: invalid character in input Log
socat 1.7.1.3-1.4Dependencies installation failed Log
soprano 2.9.2+dfsg.1-1Undetected errorLog
sp-gxmlcpp 1.0.20040603-5XMLDump.cpp:99:29: error: member access into incomplete type 'xmlBuf' (aka '_xmlBuf') Log
spark 2012.0.deb-5Undetected errorLog
stalin 0.11-5Undetected errorLog
starpu 1.0.1-4dh_install: libstarpu-dev missing files (usr/lib/starpu/*/gcc/*/*.so*), aborting Log
styx 1.8.0-1.1sysbase1.c:524:50: error: invalid token at start of a preprocessor expression Log
subtle 0.11.3224-xi-1src/subtle/panel.c:265:41: error: initializer overrides prior initialization of this subobject [-Werror,-Winitializer-overrides] Log
sugar-datastore-0.84 0.84.1-3Dependencies installation failed Log
sumo 0.17.1~dfsg-6Undetected errorLog
t-coffee 9.02.r1228-2Dependencies installation failed Log
taglib 1.8-2Undetected errorLog
tbb 4.0+r233+update5-0.2../../src/tbb/tools_api/ittnotify_config.h:297:33: error: unsupported inline asm: input with type 'long' matching output with type 'int' Log
tcc 0.9.26~git20120612.ad5f375-6libtcc1.c:673:45: error: too few arguments provided to function-like macro invocation Log
tclcl 1.20-6Undetected errorLog
tclex 1.2a1-15tclInt.h:54:13: error: typedef redefinition with different types ('int' vs 'long') Log
telepathy-qt 0.9.3-1Undetected errorLog
tinyxml 2.6.2-2Undetected errorLog
tiobench 0.3.3-5tiotest.c:34:15: error: static declaration of 'aligned_alloc' follows non-static declaration Log
tk707 0.7.21-9.2configure: error: Sufficiently new version of libasound not found. Log
topal 75-1Undetected errorLog
tpb 0.6.4-8Undetected errorLog
trafficserver 3.2.4-1configure: error: Need at least one SSL library, --with-openssl is supported Log
traverso 0.49.2-5Tsar.h:66:9: error: field has incomplete type 'void *[]' Log
triggerhappy 0.3.4-2make[1]: *** No rule to make target `evtable_EV.h', needed by `eventnames.o'. Stop. Log
troffcvt 1.04-21Undetected errorLog
tudu 0.8.2-1Undetected errorLog
ucommon 6.0.6-1Undetected errorLog
udisks2 2.1.0-4dh_auto_test: make -j1 check returned exit code 2 Log
units-filter 3.5-3Undetected errorLog
ust 2.1.1-2configure: error: The sdt.h integration was requested but the STAP_PROBEV define cannot be used. Make sure it is installed, and up to date, or use CPPFLAGS=-I/path/ to specify a non-standard path to sys/sdt.h Log
vavoom 1.33-4Undetected errorLog
vboot-utils 0~20121212-3Undetected errorLog
vdr-plugin-xineliboutput 1.0.7+cvs20130223.2117-6make[2]: *** No rule to make target `dbus/dbus-glib.h', needed by `tools/gnome_screensaver.o'. Stop. Log
verbiste 0.1.38-1Undetected errorLog
w9wm 0.4.2-7Dependencies installation failed Log
wavpack 4.60.1-3extra2.c:85:41: error: passing 'int' to parameter of incompatible type '__attribute__((__vector_size__(1 * sizeof(long long)))) long long' Log
wesnoth-1.10 1:1.10.6-2Undetected errorLog
wesnoth-1.11 1:1.11.5-1Undetected errorLog
whois 5.0.25Dependencies installation failed Log
wmbubble 1.46-4clang: error: language not recognized: '11-2.0' Log
wvdial 1.61-4.1uniconfgen.h:323:19: error: no class named 'Iter' in 'UniConfGen' Log
wvstreams 4.6.1-6./include/wvscatterhash.h:186:46: error: invalid use of non-static data member 'xstatus' Log
xapian-core 1.2.15-2Undetected errorLog
xbmc 2:11.0~git20120510.82388d5-1cpluff.c:80:35: error: too many arguments provided to function-like macro invocation Log
xcftools 1.0.7-4Undetected errorLog
xdb 1.2.0-7.2dh_install: libxdb1 missing files (debian/tmp/usr/lib/*.so.*), aborting Log
xen 4.2.2-1Undetected errorLog
xhprof 0.9.2+git20130123-1configure: error: in `/«BUILDDIR»/xhprof-0.9.2+git20130123/extension' Log
xine-lib 1.1.21-1configure: error: Pthread support is needed Log
xine-lib-1.2 1.2.3-1configure: error: Pthread support is needed Log
xmpi 2.2.3b8-13configure: error: cannot continue -- cannot find Trillium header files Log
xpp 1.5-cvs20050828-1.2cupshelper.cxx:97:10: error: member access into incomplete type 'ipp_t' (aka '_ipp_s') Log
yapet 0.8~pre2-2Undetected errorLog
yorick-av 0.0.1-2dh_auto_test: make -j1 check returned exit code 2 Log
yudit 2.9.2-3Undetected errorLog
z80ex 1.1.20rev1-1dh_install: libz80ex-dev missing files (usr/lib/lib*.a), aborting Log
zeromq 2.2.0+dfsg-4Undetected errorLog
zoneminder 1.25.0-4Undetected errorLog
zutils 0.9-7Undetected errorLog
zvbi 0.2.33-7./misc.h:56:5: error: invalid token at start of a preprocessor expression Log
zzuf 0.13.svn20100215-4Undetected errorLog
416 errors
Return to the list