Debian Package rebuild

Rebuild of the Debian archive with clang

"Not categorized" build failure(s)
clang 3.0
Return to the list

Versions: 2.9 - 3.0 - 3.1 - 3.2 - 3.3 - 3.4 - 3.4.2 - 3.5.0 - 3.6.0 - 3.8.1
PackageVersionSupposed error messageFull log Bug report
aconnectgui 0.9.0rc2-1-9configure: error: Sufficiently new version of libasound not found. Log 684508
adabrowse 4.0.3-5Undetected errorLog
adacgi 1.6-16Undetected errorLog
aeskulap 0.2.2b1-10./poolinstance.h:53:25: error: no function named 'remove_instance' with type 'void (const Glib::RefPtr &)' was found in the specified scope Log
agave 0.4.7-2.1refptr.h:208:16: error: member access into incomplete type 'gcs::PaletteTreeModel' Log
apron 0.9.10-5.2ppl.hh:14384:15: error: flexible array member 'vec_' of non-POD element type 'Coefficient []' Log
aqemu 0.8.2-1VM.cpp:4566:75: error: reference to type 'const QString' could not bind to an rvalue of type 'bool' Log
arj 3.10.22-10Undetected errorLog
arrayprobe 2.0-3.2include/linux/rcupdate.h:822:2: error: array size is negative Log
atom4 4.1-5.1engine/ai.cc:343:1: error: control reaches end of non-void function [-Werror,-Wreturn-type] Log 710408
automake1.10 1:1.10.3-1Undetected errorLog
automake1.11 1:1.11.1-1Undetected errorLog
avifile 1:0.7.48~20090503.ds-9.1common/avm_output.cpp:20:12: error: qualified reference to 'AvmOutput' is a constructor name rather than a type wherever a constructor can be declared Log
ax25-tools 0.0.8-13.2./rip98d.h:47:12: error: restrict requires a pointer or reference Log
beanstalkd 1.4.6-3./tube.h:38:16: error: field 'buried' with variable sized type 'struct job' not at the end of a struct or class is a GNU extension [-Werror,-Wgnu] Log
bin-prot 2.0.7-1Undetected errorLog
binutils-avr 2.20.1-2Undetected errorLog
binutils-h8300-hms 2.16.1-8Undetected errorLog
binutils-m68hc1x 1:2.18-3.2Undetected errorLog
binutils-msp430 2.21~msp20110716-1Undetected errorLog
binutils-z80 2.22-1Undetected errorLog
bnfc 2.2-3.1Undetected errorLog
botan1.8 1.8.13-4Undetected errorLog
boxbackup 0.11.1~r2837-1stdlib.h:896:12: error: exception specification in declaration does not match previous declaration Log
bsnes 0.084-1./nall/bit.hpp:6:5: error: types cannot be defined in a constexpr function Log
btag 1.1.2-1Undetected errorLog
ccrypt 1.9-4Undetected errorLog
centerim 4.22.10-2../../src/icqface.h:248:50: error: invalid storage class specifier in function declarator Log
chicken 4.7.0-1Undetected errorLog
cook 2.33-1Undetected errorLog
coriander 2.0.1-1configure: error: The XV overlay libraries were not found Log
cpuburn 1.4a-2burnK7.S:83:10: error: unexpected token in '.fill' directive Log
crash 6.0.2-1Undetected errorLog
darktable 0.9.3-1colormatrices.c:31:34: error: variable 'dt_profiled_colormatrices' is not needed and will not be emitted [-Werror,-Wunneeded-internal-declaration] Log
dicom3tools 1.0~20111213-1./Imakefile:160:3: error: invalid preprocessing directive Log
digikam 2:1.9.0-3iccmanager.h:126:88: error: type 'const Digikam::IccProfile' does not provide a call operator Log
discount 2.1.2-2Undetected errorLog
dmapi 2.2.10-1Undetected errorLog
dvdisaster 0.72.1-2Undetected errorLog
elfutils 0.152-1elf_begin.c:632:23: error: comparison of integers of different signs: '__off_t' (aka 'long') and 'size_t' (aka 'unsigned long') [-Werror,-Wsign-compare] Log 758064
enigma 1.10~~pre-alpha+r2210-1./ecl_dict.hh:134:27: error: calling a private constructor of class 'ecl::XInvalidKey' Log
estic 1.61-20./coll.h:317:7: error: invalid operands to binary expression ('Stream' and 'u32' (aka 'unsigned int')) Log
evolvotron 0.6.1-1Undetected errorLog
firebird2.1 2.1.4.18393-0.ds2-6../src/include/../common/classes/alloc.h:435:14: error: exception specification in declaration does not match previous declaration Log
flexml 1.9.2-1Undetected errorLog
flowscan 1.006-13configure: error: Please change /etc/services so that the service name for 80/tcp is www with alias http Log
fort77 1.15-8Undetected errorLog
fracplanet 0.4.0-1.1Undetected errorLog
freetype 2.4.8-1ttload.c:550:9: error: using extended field designator is an extension [-Werror,-pedantic] Log
fwbuilder 5.0.0-1CompilerDriver_ipt_run.cpp:655:19: error: reference to overloaded function could not be resolved; did you mean to call it? Log
gambc 4.2.8-1.1Undetected errorLog
gap 4r4p12-2Undetected errorLog
gauche 0.9.1-5 Log
gauche-c-wrapper 0.6.1-4.1clang: error: unable to execute command: Broken pipe Log
gbsplay 0.0.91-1Undetected errorLog
gcc-3.3 1:3.3.6ds1-25Undetected errorLog
gcc-h8300-hms 1:3.4.6-7Undetected errorLog
gcc-mingw-w64 2./genfixes: 1: ./genfixes: autogen: not found Log
gcc-mingw32 4.4.4-1Undetected errorLog
gcc-msp430 4.5.3~mspgcc-20110716-3Undetected errorLog
gdb-avr 7.2-1Undetected errorLog
gdb-msp430 7.2~mspgcc-7.2-20110612-1Undetected errorLog
gforth 0.7.0+ds1-6make[1]: emacs: Command not found Log
gnade 1.6.2-9Undetected errorLog
gnome-scan 0.6.2-1gnome-scan-dialog.c:565:13: error: format not a string literal and no format arguments [-Werror=format-security] Log
gnucap 1:0.36~20091207-2./mg_.h:134:19: error: variable has incomplete type 'C_Comment' Log
golang 1:60.3-1executable.c:787:25: error: argument to 'sizeof' in 'memset' call is the same expression as the destination; did you mean to provide an explicit length? [-Werror,-Wsizeof-pointer-memaccess] Log
golang-weekly 2011.09.21-1Undetected errorLog
goplay 0.4-1engine.h:153:24: error: calling a protected constructor of class 'wibble::commandline::OptionGroup' Log 753645
gprolog 1.3.0-6.1Undetected errorLog
granule 1.3.0-1Granule.cpp:58:1: error: extraneous 'template<>' in declaration of variable 'm_default_entity_loader' Log
graphite2 1.0.3.real-1Undetected errorLog
guile-gnome-platform 2.16.1-6.1Undetected errorLog
gxneur 0.15.0-2misc.c:100:20: error: variable 'all_modifiers' is not needed and will not be emitted [-Werror,-Wunneeded-internal-declaration] Log
haildb 2.3.2-1Undetected errorLog
haskell-gstreamer 0.12.0-1DEPS Log
hiredis 0.10.1-3hiredis.c:799:31: error: second argument to 'va_arg' is of incomplete type 'void' Log
htmlcxx 0.85-2Undetected errorLog
hugs98 98.200609.21-5.3tools/make_bootlib: 68: tools/make_bootlib: -D__HUGS__: not found Log
hylafax 2:6.1~20111227-4Undetected errorLog
ibus-qt 1.3.1-2qibusserializable.h:94:59: error: non-const lvalue reference to type 'QVariant' cannot bind to a temporary of type 'QVariant' Log
icedove 8.0-2unwind.h:43:46: error: unknown machine mode '__unwind_word__' Log
iceowl 1.0~b2-7configure: error: ./configure failed for mozilla Log
imvirt 0.9.1-1vmware.c:67:5: error: invalid operand for instruction Log
ipsec-tools 1:0.8.0-9isakmp.c:1137:11: error: promoted type 'int' of K&R function parameter is not compatible with the parameter type 'u_int8_t' (aka 'unsigned char') declared in a previous prototype [-Werror] Log
iptux 0.5.2-1AnalogFS.cpp:160:23: error: assigning to 'struct entry *' from incompatible type 'struct entry *'; Log
isomd5sum 1:1.0.7+git.20110618.6c9cd2f-1md5.c:160:24: error: argument to 'sizeof' in 'memset' call is the same expression as the destination; did you mean to dereference it? [-Werror,-Wsizeof-pointer-memaccess] Log
kaya 0.4.4-5Undetected errorLog
kbibtex 0.4-1Undetected errorLog 753270
kdeaccessibility 4:4.6.5-1componentfactory.h:84:62: error: calling a private constructor of class 'QString' Log
keepassx 0.4.3-1Undetected errorLog
kicad 0.0.20110616-1clone_allocator.hpp:34:22: error: allocating an object of abstract class type 'LIB_ITEM' Log
kmetronome 0.10.0-3Undetected errorLog
konq-plugins 4:4.6.1-1archivedialog.cpp:492:22: error: explicit instantiation cannot have a storage class Log
kphotoalbum 4.1.1-4componentfactory.h:84:62: error: calling a private constructor of class 'QString' Log
kplayer 1:0.7-2.1kplayernode.cpp:2401:5: error: unexpected ':' in nested name specifier Log
krusader 1:2.4.0~beta1+git76+de1ea35-1checksumdlg.cpp:53:91: error: default arguments can only be specified for parameters in a function declaration Log
lambdabot 4.2.3.2-2Undetected errorLog
lcgdm 1.8.2-1Undetected errorLog
libb-hooks-parser-perl 0.09-1Undetected errorLog
libcmis 0.1.0-1cmis-client.cxx:137:13: error: delete called on 'libcmis::Session' that is abstract but has non-virtual destructor [-Werror,-Wdelete-non-virtual-dtor] Log
libdbi-drivers 0.8.3-1+s-2.1error: invalid value '4' in '-O20' Log
libdebian-installer 0.80../../../include/debian-installer/mem_chunk.h:33:93: error: 'nonnull' attribute applied to function with no pointer arguments [-Werror] Log
libdevel-declare-perl 0.006008-1Undetected errorLog
libfakekey 0.1-3ld: final link failed: Bad value Log
libgmpada 0.0.20110925-2Undetected errorLog
libguestfs 1:1.14.9-1../../../src/launch.c:431:3: error: unknown flag Log
liblognorm 0.3.2-1Undetected errorLog
libnetserver-generic-perl 1.03-9Undetected errorLog
liboil 0.3.17-2wavelet.c:1759:27: error: invalid use of a cast in a inline asm context requiring an l-value: remove the cast or build with -fheinous-gnu-extensions Log
libosip2 3.3.0-1osip_message_parse.c:850:5: error: format not a string literal and no format arguments [-Werror=format-security] Log
libphash 0.9.4-1.2CImg.h:27244:18: error: declaration of 't' shadows template parameter Log
librep 0.90.2-1.3Undetected errorLog
libsdl1.2 1.2.14-7../../src/video/SDL_blit_A.c:1999:5: error: invalid operand for instruction Log
libtorrent 0.12.9-3poll_select.cc:126:28: error: cannot allocate function type 'rak::cacheline_allocator<> ()' with new Log
libwx-perl 1:0.9903-1Undetected errorLog
libwx-scintilla-perl 0.36-1Undetected errorLog
lightspark 0.5.3-2Undetected errorLog
lintian 2.5.4Undetected errorLog
linux-2.6 3.1.8-2rcupdate.h:822:2: error: array size is negative Log
linux-tools 3.1.1-3Undetected errorLog
lordsawar 0.2.0-1armyproto.cpp:39:34: error: array initializer must be an initializer list Log
lsb-build-cc3 3.2.0-1unwind.h:43:46: error: unknown machine mode '__unwind_word__' Log
ltrace 0.5.3-2.1ld: warning: cannot find entry symbol _start; defaulting to 0000000000400180 Log
lua-gtk 0.9+20100528-2limits.h:37:54: error: missing binary operator before token "(" Log
lusca 0.1~svn14809-1client_side_ranges.c:42:5: error: format not a string literal and no format arguments [-Werror=format-security] Log
mailsync 5.2.2-1.1configure: error: a working c-client installation is required for building mailsync Log
memtest86 3.5-2.3main.c:116:2: error: indirect goto in function with no address-of-label expressions Log
mesa 7.11.2-1nouveau_array.c:49:16: error: illegal storage class on function Log
mingw32 4.2.1.dfsg-2Undetected errorLog
mingw32-binutils 2.20-0.2Undetected errorLog
mupdf 0.9-2:4:1: error: warning: ignoring directive for now Log 755741
muse 2.0~rc2-1Undetected errorLog
ncap 1.9.2-1wrapsrv.c:346:13: error: function 'usage' could be declared with attribute 'noreturn' [-Werror,-Wmissing-noreturn] Log
netsurf 2.8-1Undetected errorLog
nget 0.27.1-11./par2/par2fileformat.h:89:25: error: flexible array member 'entries' of non-POD element type 'FILEVERIFICATIONENTRY []' Log
nn 6.7.3-3.1make[2]: *** No rule to make target ` articles.h', needed by `nn.o'. Stop. Log
obby 0.4.8-1../inc/zeroconf_avahi.hpp:135:40: error: assigning to 'AvahiWatchEvent' from incompatible type 'int'; Log
opencity 0.0.6.4stable-1../../src/destination.h:25:6: error: redeclaration of already-defined enum 'OPENCITY_DIRECTION' is a GNU extension [-Werror,-pedantic,-Wgnu] Log
otcl 1.14+dfsg-2tclInt.h:54:13: error: typedef redefinition with different types ('int' vs 'typeof (((int *)0) - ((int *)0))' (aka 'long')) Log
padre 0.92.ds1-1Undetected errorLog
pdfedit 0.4.5-2Object.h:209:3: error: anonymous union at class scope must not have a storage specifier Log
pdftk 1.44-4PdfStream.java:242: error: PdfEncryption cannot be resolved to a type Log
pearpc 0.5.dfsg-2jitc_mmu.S:122:2: error: unknown use of instruction mnemonic without a size suffix Log
pentobi 1.0-1c++0x_warning.h:32:2: error: #error This file requires compiler and library support for the upcoming ISO C++ standard, C++0x. This support is currently experimental, and must be enabled with the -std=c++0x or -std=gnu++0x compiler options. Log
pixman 0.24.0-1Undetected errorLog
polkit-qt-1 0.103.0-1Undetected errorLog
polybori 0.5~rc1-2.1polybori/include/CDDManager.h:281:28: error: 'mutable' cannot be applied to references Log
postler 0.1.1-1.1wscript:137: error: the configuration failed (see '/build/postler-sGqcMS/postler-0.1.1/_build_/config.log') Log
pouetchess 0.2.0-4Undetected errorLog
prison 1.0+dfsg-1Undetected errorLog
python-sfml 1.5-2glext.h:5072:9: error: 'ptrdiff_t' does not name a type Log
pyxine 0.1alpha2-7pyxine/libxine_wrap.c:3141:2: error: invalid preprocessing directive Log
pyzmq 2.1.10-2Undetected errorLog
qtwebkit 2.2.0-3runtime/JSTypeInfo.h:73:52: error: use of logical '&&' with constant operand [-Werror,-Wconstant-logical-operand] Log
qxmlrpc 0.0.svn6-2Undetected errorLog
redis 2:2.4.5-1hiredis.c:700:31: error: second argument to 'va_arg' is of incomplete type 'void' Log
reprepro 4.8.2-1sourceextraction.c:133:2: error: illegal storage class on function Log
ruby-ferret 0.11.6-3global.c:372:24: error: passing 'int' to parameter of incompatible type 'struct timeval'; Log
ruby-yajl 1.0.0-1Undetected errorLog
ruby1.8 1.8.7.352-2Undetected errorLog
samhain 2.8.3a-1./src/sh_tiger1_64.c:375:3: error: ran out of registers during register allocation Log
sbcl 2:1.0.55.0-1Undetected errorLog
sbnc 1.2-24./../Object.h:163:14: error: 'CUser' is an incomplete type Log
seabios 1.6.3-2out//../src/biosvar.h:253:12: error: invalid output constraint '=Qi' in asm Log
serna-free 4.3.0.20110221-7AssocVector.h:177:27: error: use of undeclared 'operator()' Log
simgrid 3.6.2-1Undetected errorLog
sks-ecc 0.93-2tfm/mpi.c:2565:15: error: unknown register name '%cc' in asm Log
sleuthkit 3.2.3-2Undetected errorLog
socat 1.7.1.3-1.2./xio.h:356:4: error: #error "unexpected size of off_t, please report this as bug" Log
soundmodem 0.16-1../matlib/mat.hh:450:4: error: assigning to 'unsigned int *' from incompatible type 'void *'; Log
squeak-vm 1:4.4.7.2357-1Undetected errorLog 740972
sssd 1.2.1-4.3db/sysdb.c:850:22: error: format not a string literal and no format arguments [-Werror=format-security] Log
stalin 0.11-5Undetected errorLog
stress 1.0.1-1stress.c:466:5: error: ignoring return value of function declared with const attribute [-Werror,-Wunused-value] Log
strigi 0.7.7-1Undetected errorLog
subtitlecomposer 0.5.3-3scripting_subtitle.cpp:68:13: error: calling a private constructor of class 'SubtitleComposer::Scripting::SubtitleLine' Log
tclex 1.2a1-15tclInt.h:54:13: error: typedef redefinition with different types ('int' vs 'typeof (((int *)0) - ((int *)0))' (aka 'long')) Log
tdb 1.2.9-4Undetected errorLog
tevent 0.9.14-2Undetected errorLog
topal 74-1Undetected errorLog
tpb 0.6.4-6Undetected errorLog
traverso 0.49.2-4Tsar.h:66:9: error: field has incomplete type 'void *[]' Log
triggerhappy 0.3.4-2make[1]: *** No rule to make target `evtable_EV.h', needed by `eventnames.o'. Stop. Log
troffcvt 1.04-20Undetected errorLog
tudu 0.8.1-1Undetected errorLog
ufw 0.30.1-2Undetected errorLog
vidalia 0.2.15-1TorSettings.h:80:38: error: invalid storage class specifier in function declarator Log
vmpk 0.4.0-2RtMidi.cpp:2449:15: error: 'long long type-name' is invalid Log
wavpack 4.60.1-2extra2.c:85:41: error: passing 'int' to parameter of incompatible type '__attribute__((__vector_size__(1 * sizeof(long long)))) long long'; Log
wcd 5.2.0-1Undetected errorLog
win32-loader 0.7.4.3win32-loader.c:41:3: error: illegal storage class on function Log
wmbubble 1.46-2.1clang: error: language not recognized: '11-2.0' Log
wvdial 1.61-4uniconfgen.h:323:19: error: no class named 'Iter' in 'UniConfGen' Log
xdb 1.2.0-7.2dh_install: libxdb1 missing files (debian/tmp/usr/lib/*.so.*), aborting Log
xmpi 2.2.3b8-11configure: error: cannot continue -- cannot find Trillium header files Log
xorp 1.8.3-1Undetected errorLog
xsd 3.3.0.1-1.2static-ptr.hxx:63:28: error: cannot allocate function type 'Cult::MM::KeyList ()' with new Log
zapping 0.10~cvs6-7../../libtv/misc.h:52:5: error: invalid token at start of a preprocessor expression Log
199 errors
Return to the list